{"text_format":"1","workbook":"xlsx","n_sheets":4,"sheets":["Calculation","Explanation","Calculation template empty","Calculation template"],"not_rendered":{"charts":18,"images":1,"macros":1,"external_links":0,"defined_names":282,"comments":3,"pivot_tables":0},"unopened":[],"bounds":{"document_bytes":16777216,"sheet_cells":100000,"rows_first":2000,"rows_last":500,"rows_between":2000,"halvings":0,"cell_chars":16384,"cell_head_chars":4096},"cells_cut":0,"cells_raw":0,"read":"whole","date_system":"1900"}

{"sheet":"Calculation","index":0,"n_rows":156,"n_cols":106,"rows_kept":156,"cut":false,"hidden":false,"merged":[[2,4,2,5],[21,2,22,2],[35,1,35,4],[93,0,93,1]]}
[]
["Shear strength at surface","cs",16,"kN/m2"]
["Peak value for shear strength evaluated in lab","clab",28,"kN/m2","Factor for increasing shear strength peak  ",null,10,"%"]
["Peak value for shear strength","c",{"$f":"C3*(1+G3/100)","v":30.800000000000004},"kN/m2",null,null,null,null,null,null,null,null,null,null," "]
["Residual value for shear strength","cR",15,"kN/m2",{"$f":"IF(cR<=t0,\"Ok\",\"cR too high\")","v":"Ok"}]
["Shear stress at elastic limit","tel",16,"kN/m2",null,null,"t",0,{"$f":"tel","v":16},{"$f":"I6+($AB$6-$I$6)/19","v":16.778947368421054},{"$f":"J6+($AB$6-$I$6)/19","v":17.557894736842108},{"$f":"K6+($AB$6-$I$6)/19","v":18.336842105263162},19.115789473684217,19.894736842105271,20.673684210526325,21.452631578947379,22.231578947368433,23.010526315789487,23.789473684210542,24.568421052631596,25.34736842105265,26.126315789473704,26.905263157894758,27.684210526315812,28.463157894736867,29.242105263157921,30.021052631578975,{"$f":"c_peak","v":30.800000000000004},{"$f":"cR","v":15},{"$f":"AC6","v":15}]
["Deviator strain at elastic limit","gel",{"$f":"g_f*tel/(2*c_peak-tel)","v":1.0526315789473682E-2},null,null,null,"g",0,{"$f":"gel","v":1.0526315789473682E-2},{"$f":"g_f-(g_f-gel)*(1-(J6-tel)/(c_peak-tel))^0.5","v":1.1045707636300375E-2},1.1579738837738978E-2,1.212972178271414E-2,1.2697177518089672E-2,1.3283885376146724E-2,1.3891948895192154E-2,1.4523885091134758E-2,1.5182748063500407E-2,1.5872304603120835E-2,1.6597291337035615E-2,1.7363805090866932E-2,1.8179921994381745E-2,1.9056734201519172E-2,2.0010210782328786E-2,2.1064860891357097E-2,2.2261942545567407E-2,2.3681902545433502E-2,2.55324304456786E-2,{"$f":"g_f","v":0.03},{"$f":"def_cR","v":0.2},{"$f":"def_cR+0.05","v":0.25}]
["Deviator strain at failure limit","gf",0.03,null,null,null,"t0",{"$f":"t0","v":22.345320863972443},22.345320863972443,22.345320863972443,22.345320863972443,22.345320863972443,22.345320863972443,22.345320863972443,22.345320863972443,22.345320863972443,22.345320863972443,22.345320863972443,22.345320863972443,22.345320863972443,22.345320863972443,22.345320863972443,22.345320863972443,22.345320863972443,22.345320863972443,22.345320863972443,22.345320863972443,22.345320863972443,22.345320863972443,22.345320863972443]
["Elastic modulus at shear","G",{"$f":"tel/gel","v":1520.0000000000002},null,null,null,null,null,null,null,null,null,null,null,null,null,null,null,null,null,null,null,null,null,null,null,null,{"$f":"F9","v":0}]
["Elastic modulus","Emean",{"$f":"G/c_peak*2*(1+0.5)*(cS+c_peak)/2","v":3464.4155844155844}]
["Post peak slip at z=0 when cR is reached","dcR",0.2,"m"]
["Density:","dstart",16]
[null,"dgain",0]
["Depth to slip surface","H",20,"m"]
["Gradient","dy/dx",7.0000000000000007E-2]
["Sensitivity ratio","cR/cu",{"$f":"cR/c_peak","v":0.48701298701298695}]
[]
["Colour indication:"]
["Cells that require input"]
["to<tel"]
["to>tel"]
["t+Dt<tel",null,"  Stage I"]
["tel<t+Dt<cu"]
["cu<t+Dt<cR",null,"Stage IIa"]
["t+Dt=cR",null,"Stage IIb"]
[null,null,null,null,null,null,null,null,null,null,"c",null,null,null,null,null,null,null,"to","cR"]
[]
[null,"Stage I",null,null,null,null,null,null,null,null,"Stage II"]
[null,"Dx1","Dx2","Dx3","Dx4","Dx5","Dx6","Dx7","Dx8","Dx9","Dx10","Dx11","Dx12","Dx13","Dx14","Dx15","Dx16","Dx17","Dx18","Dx19","Dx20","SDx"]
["length of Dx",36.385826059010505,17.041257051505603,9.5132360995152361,6.7452629987239696,5.3397221812728493,4.5215485620236722,4.0223895573480908,3.7500187400899088,6.0749793369883278,2.8019464525139419,2.5244141873137331,2.3546199179529212,2.2343502861473765,2.147346697921872,2.0843036691296248,2.0397716123174328,2.0132189400091605,1.9994234147459702,1.8491037887086547E-12,38.610033302034523,{"$f":"SUM(Dx)","v":152.20366906656659}]
["Dt",{"$f":"0.5+((COLUMN(A1)-COLUMN($A$1))^grad)*((c_peak-$B$39)/10)","v":0.5},{"$f":"((COLUMN(B1)-COLUMN($A$1))^grad)*((c_peak-$B$39)/10)","v":0.84546791360275608},0.88750177437679911,0.91305222291871213,0.93162541930840115,0.946291699435723,0.95844615141690004,0.9688443102449743,{"$f":"E39-0.001-AR39","v":1.5024496447232956},{"$f":"IF(t0>cR,-(c_peak-t0)/9,-(c_peak-cR)/9)","v":-0.93940879289195123},-0.93940879289195123,-0.93940879289195123,-0.93940879289195123,-0.93940879289195123,-0.93940879289195123,-0.93940879289195123,-0.93940879289195123,-0.93940879289195123,{"$f":"cR-CP39","v":-7.3453208639724572},0]
["Start (length from x=0)",0,{"$f":"ROUND(SUM($B$30:B30),0)","v":36},{"$f":"ROUND(SUM($B$30:C30),0)","v":53},{"$f":"ROUND(SUM($B$30:D30),0)","v":63},{"$f":"ROUND(SUM($B$30:E30),0)","v":70},{"$f":"ROUND(SUM($B$30:F30),0)","v":75},{"$f":"ROUND(SUM($B$30:G30),0)","v":80},{"$f":"ROUND(SUM($B$30:H30),0)","v":84},{"$f":"ROUND(SUM($B$30:I30),0)","v":87},{"$f":"ROUND(SUM($B$30:J30),0)","v":93},{"$f":"ROUND(SUM($B$30:K30),0)","v":96},{"$f":"ROUND(SUM($B$30:L30),0)","v":99},{"$f":"ROUND(SUM($B$30:M30),0)","v":101},{"$f":"ROUND(SUM($B$30:N30),0)","v":103},{"$f":"ROUND(SUM($B$30:O30),0)","v":105},{"$f":"ROUND(SUM($B$30:P30),0)","v":108},{"$f":"ROUND(SUM($B$30:Q30),0)","v":110},{"$f":"ROUND(SUM($B$30:R30),0)","v":112},{"$f":"ROUND(SUM($B$30:S30),0)","v":114},{"$f":"ROUND(SUM($B$30:T30),0)","v":114}]
[]
[]
[null,null,null,null,null,null,"STAGE I",null,null,null,null,null,null,null,null,null,null,null,null,null,null,null,null,null,null,null,null,null,null,null,null,null,null,null,null,null,null,null,null,null,null,null,null,null,null,null,null,null,null,null,null,"STAGE II"]
[null,"In situ",null,null,null,"Stage II",null,"x",1,null,{"$f":"OFFSET($B$30,0,(COLUMN(B1)-COLUMN($B$1))/5)","v":36.385826059010505},null,"x",{"$f":"I36+1","v":2},null,{"$f":"OFFSET($B$30,0,(COLUMN(G1)-COLUMN($B$1))/5)","v":17.041257051505603},null,"x",{"$f":"N36+1","v":3},null,{"$f":"OFFSET($B$30,0,(COLUMN(L1)-COLUMN($B$1))/5)","v":9.5132360995152361},null,"x",{"$f":"S36+1","v":4},null,{"$f":"OFFSET($B$30,0,(COLUMN(Q1)-COLUMN($B$1))/5)","v":6.7452629987239696},null,"x",{"$f":"X36+1","v":5},null,{"$f":"OFFSET($B$30,0,(COLUMN(V1)-COLUMN($B$1))/5)","v":5.3397221812728493},null,"x",{"$f":"AC36+1","v":6},null,{"$f":"OFFSET($B$30,0,(COLUMN(AA1)-COLUMN($B$1))/5)","v":4.5215485620236722},null,"x",{"$f":"AH36+1","v":7},null,{"$f":"OFFSET($B$30,0,(COLUMN(AF1)-COLUMN($B$1))/5)","v":4.0223895573480908},null,"x",{"$f":"AM36+1","v":8},null,{"$f":"OFFSET($B$30,0,(COLUMN(AK1)-COLUMN($B$1))/5)","v":3.7500187400899088},null,"x",{"$f":"AR36+1","v":9},null,{"$f":"OFFSET($B$30,0,(COLUMN(AP1)-COLUMN($B$1))/5)","v":6.0749793369883278},null,"x",{"$f":"AW36+1","v":10},null,{"$f":"OFFSET($B$30,0,(COLUMN(AU1)-COLUMN($B$1))/5)","v":2.8019464525139419},null,"x",{"$f":"BB36+1","v":11},null,{"$f":"OFFSET($B$30,0,(COLUMN(AZ1)-COLUMN($B$1))/5)","v":2.5244141873137331},null,"x",{"$f":"BG36+1","v":12},null,{"$f":"OFFSET($B$30,0,(COLUMN(BE1)-COLUMN($B$1))/5)","v":2.3546199179529212},null,"x",{"$f":"BL36+1","v":13},null,{"$f":"OFFSET($B$30,0,(COLUMN(BJ1)-COLUMN($B$1))/5)","v":2.2343502861473765},null,"x",{"$f":"BQ36+1","v":14},null,{"$f":"OFFSET($B$30,0,(COLUMN(BO1)-COLUMN($B$1))/5)","v":2.147346697921872},null,"x",{"$f":"BV36+1","v":15},null,{"$f":"OFFSET($B$30,0,(COLUMN(BT1)-COLUMN($B$1))/5)","v":2.0843036691296248},null,"x",{"$f":"CA36+1","v":16},null,{"$f":"OFFSET($B$30,0,(COLUMN(BY1)-COLUMN($B$1))/5)","v":2.0397716123174328},null,"x",{"$f":"CF36+1","v":17},null,{"$f":"OFFSET($B$30,0,(COLUMN(CD1)-COLUMN($B$1))/5)","v":2.0132189400091605},null,"x",{"$f":"CK36+1","v":18},null,{"$f":"OFFSET($B$30,0,(COLUMN(CI1)-COLUMN($B$1))/5)","v":1.9994234147459702},null,"x",{"$f":"CP36+1","v":19},null,{"$f":"OFFSET($B$30,0,(COLUMN(CN1)-COLUMN($B$1))/5)","v":1.8491037887086547E-12},null,"x",{"$f":"CU36+1","v":20},null,{"$f":"OFFSET($B$30,0,(COLUMN(CS1)-COLUMN($B$1))/5)","v":38.610033302034523}]
["start of Dx(Sx)",null,null,null,null,null,null,null,null,null,{"$f":"OFFSET($B$32,0,(COLUMN(B1)-COLUMN($B$1))*5)&\" (\"&ROUND($V$30,0)&\")\"","v":"0 (152)"},null,null,null,null,{"$f":"OFFSET($B$32,0,(COLUMN(G1)-COLUMN($B$1))/5)&\" (\"&ROUND($V$30,0)&\")\"","v":"36 (152)"},null,null,null,null,{"$f":"OFFSET($B$32,0,(COLUMN(L1)-COLUMN($B$1))/5)&\" (\"&ROUND($V$30,0)&\")\"","v":"53 (152)"},null,null,null,null,{"$f":"OFFSET($B$32,0,(COLUMN(Q1)-COLUMN($B$1))/5)&\" (\"&ROUND($V$30,0)&\")\"","v":"63 (152)"},null,null,null,null,{"$f":"OFFSET($B$32,0,(COLUMN(V1)-COLUMN($B$1))/5)&\" (\"&ROUND($V$30,0)&\")\"","v":"70 (152)"},null,null,null,null,{"$f":"OFFSET($B$32,0,(COLUMN(AA1)-COLUMN($B$1))/5)&\" (\"&ROUND($V$30,0)&\")\"","v":"75 (152)"},null,null,null,null,{"$f":"OFFSET($B$32,0,(COLUMN(AF1)-COLUMN($B$1))/5)&\" (\"&ROUND($V$30,0)&\")\"","v":"80 (152)"},null,null,null,null,{"$f":"OFFSET($B$32,0,(COLUMN(AK1)-COLUMN($B$1))/5)&\" (\"&ROUND($V$30,0)&\")\"","v":"84 (152)"},null,null,null,null,{"$f":"OFFSET($B$32,0,(COLUMN(AP1)-COLUMN($B$1))/5)&\" (\"&ROUND($V$30,0)&\")\"","v":"87 (152)"},null,null,null,null,{"$f":"OFFSET($B$32,0,(COLUMN(AU1)-COLUMN($B$1))/5)&\" (\"&ROUND($V$30,0)&\")\"","v":"93 (152)"},null,null,null,null,{"$f":"OFFSET($B$32,0,(COLUMN(AZ1)-COLUMN($B$1))/5)&\" (\"&ROUND($V$30,0)&\")\"","v":"96 (152)"},null,null,null,null,{"$f":"OFFSET($B$32,0,(COLUMN(BE1)-COLUMN($B$1))/5)&\" (\"&ROUND($V$30,0)&\")\"","v":"99 (152)"},null,null,null,null,{"$f":"OFFSET($B$32,0,(COLUMN(BJ1)-COLUMN($B$1))/5)&\" (\"&ROUND($V$30,0)&\")\"","v":"101 (152)"},null,null,null,null,{"$f":"OFFSET($B$32,0,(COLUMN(BO1)-COLUMN($B$1))/5)&\" (\"&ROUND($V$30,0)&\")\"","v":"103 (152)"},null,null,null,null,{"$f":"OFFSET($B$32,0,(COLUMN(BT1)-COLUMN($B$1))/5)&\" (\"&ROUND($V$30,0)&\")\"","v":"105 (152)"},null,null,null,null,{"$f":"OFFSET($B$32,0,(COLUMN(BY1)-COLUMN($B$1))/5)&\" (\"&ROUND($V$30,0)&\")\"","v":"108 (152)"},null,null,null,null,{"$f":"OFFSET($B$32,0,(COLUMN(CD1)-COLUMN($B$1))/5)&\" (\"&ROUND($V$30,0)&\")\"","v":"110 (152)"},null,null,null,null,{"$f":"OFFSET($B$32,0,(COLUMN(CI1)-COLUMN($B$1))/5)&\" (\"&ROUND($V$30,0)&\")\"","v":"112 (152)"},null,null,null,null,{"$f":"OFFSET($B$32,0,(COLUMN(CN1)-COLUMN($B$1))/5)&\" (\"&ROUND($V$30,0)&\")\"","v":"114 (152)"},null,null,null,null,{"$f":"OFFSET($B$32,0,(COLUMN(CS1)-COLUMN($B$1))/5)&\" (\"&ROUND($V$30,0)&\")\"","v":"114 (152)"}]
["Z från slip surface","to","Density","tel","cu","tmax","t","Dt","t+Dt","g(t)","d (t)","t","Dt","t+Dt","g(t)","d (t)","t","Dt","t+Dt","g(t)","d (t)","t","Dt","t+Dt","g(t)","d (t)","t","Dt","t+Dt","g(t)","d (t)","t","Dt","t+Dt","g(t)","d (t)","t","Dt","t+Dt","g(t)","d (t)","t","Dt","t+Dt","g(t)","d (t)","t","Dt","t+Dt","g(t)","d (t)","t","Dt","t+Dt","g(t)","d (t)","t","Dt","t+Dt","g(t)","d (t)","t","Dt","t+Dt","g(t)","d (t)","t","Dt","t+Dt","g(t)","d (t)","t","Dt","t+Dt","g(t)","d (t)","t","Dt","t+Dt","g(t)","d (t)","t","Dt","t+Dt","g(t)","d (t)","t","Dt","t+Dt","g(t)","d (t)","t","Dt","t+Dt","g(t)","d (t)","t","Dt","t+Dt","g(t)","d (t)","t","Dt","t+Dt","g(t)","d (t)"]
[0,{"$f":"Density*Height*SIN(ATAN(grad))","v":22.345320863972443},{"$f":"$C$12+$C$13*(Height-z)","v":16},{"$f":"tel*cu/c_peak","v":16},{"$f":"c_peak-(c_peak-cS)*z/Height","v":30.800000000000004},{"$f":"c_peak","v":30.800000000000004},{"$f":"to","v":22.345320863972443},{"$f":"B31","v":0.5},{"$f":"t+dt_z","v":22.845320863972443},{"$f":"IF(I39<t_el,(I39-t)*gel/t_el,(IF(to>t_el,(g_f-gel)*(SQRT(1-(to-t_el)/(cu-t_el))-SQRT(1-(I39-t_el)/(cu-t_el))),(t_el-to)*gel/t_el+(g_f-gel)*(1-SQRT(ABS(1-(I39-t_el)/(cu-t_el)))))))","v":4.4185206930851971E-4},0,{"$f":"t_Dt","v":22.845320863972443},{"$f":"C31","v":0.84546791360275608},{"$f":"L39+M39","v":23.6907887775752},{"$f":"IF(N39<t_el,(N39-t)*gel/t_el,(IF(to>t_el,(g_f-gel)*(SQRT(1-(to-t_el)/(cu-t_el))-SQRT(1-(N39-t_el)/(cu-t_el))),(t_el-to)*gel/t_el+(g_f-gel)*(1-SQRT(ABS(1-(N39-t_el)/(cu-t_el)))))))","v":1.2218654168959725E-3},0,{"$f":"N39","v":23.6907887775752},{"$f":"D31","v":0.88750177437679911},{"$f":"Q39+R39","v":24.578290551951998},{"$f":"IF(S39<t_el,(S39-t)*gel/t_el,(IF(to>t_el,(g_f-gel)*(SQRT(1-(to-t_el)/(cu-t_el))-SQRT(1-(S39-t_el)/(cu-t_el))),(t_el-to)*gel/t_el+(g_f-gel)*(1-SQRT(ABS(1-(S39-t_el)/(cu-t_el)))))))","v":2.0923927981755163E-3},0,{"$f":"S39","v":24.578290551951998},{"$f":"E31","v":0.91305222291871213},{"$f":"V39+W39","v":25.491342774870709},{"$f":"IF(X39<t_el,(X39-t)*gel/t_el,(IF(to>t_el,(g_f-gel)*(SQRT(1-(to-t_el)/(cu-t_el))-SQRT(1-(X39-t_el)/(cu-t_el))),(t_el-to)*gel/t_el+(g_f-gel)*(1-SQRT(ABS(1-(X39-t_el)/(cu-t_el)))))))","v":3.055595156964813E-3},0,{"$f":"X39","v":25.491342774870709},{"$f":"F31","v":0.93162541930840115},{"$f":"AA39+AB39","v":26.422968194179109},{"$f":"IF(AC39<t_el,(AC39-t)*gel/t_el,(IF(to>t_el,(g_f-gel)*(SQRT(1-(to-t_el)/(cu-t_el))-SQRT(1-(AC39-t_el)/(cu-t_el))),(t_el-to)*gel/t_el+(g_f-gel)*(1-SQRT(ABS(1-(AC39-t_el)/(cu-t_el)))))))","v":4.128305167363705E-3},0,{"$f":"AC39","v":26.422968194179109},{"$f":"G31","v":0.946291699435723},{"$f":"AF39+AG39","v":27.369259893614831},{"$f":"IF(AH39<t_el,(AH39-t)*gel/t_el,(IF(to>t_el,(g_f-gel)*(SQRT(1-(to-t_el)/(cu-t_el))-SQRT(1-(AH39-t_el)/(cu-t_el))),(t_el-to)*gel/t_el+(g_f-gel)*(1-SQRT(ABS(1-(AH39-t_el)/(cu-t_el)))))))","v":5.3427158911762427E-3},0,{"$f":"AH39","v":27.369259893614831},{"$f":"H31","v":0.95844615141690004},{"$f":"AK39+AL39","v":28.327706045031732},{"$f":"IF(AM39<t_el,(AM39-t)*gel/t_el,(IF(to>t_el,(g_f-gel)*(SQRT(1-(to-t_el)/(cu-t_el))-SQRT(1-(AM39-t_el)/(cu-t_el))),(t_el-to)*gel/t_el+(g_f-gel)*(1-SQRT(ABS(1-(AM39-t_el)/(cu-t_el)))))))","v":6.7594156828066927E-3},0,{"$f":"AM39","v":28.327706045031732},{"$f":"I31","v":0.9688443102449743},{"$f":"AP39+AQ39","v":29.296550355276707},{"$f":"IF(AR39<t_el,(AR39-t)*gel/t_el,(IF(to>t_el,(g_f-gel)*(SQRT(1-(to-t_el)/(cu-t_el))-SQRT(1-(AR39-t_el)/(cu-t_el))),(t_el-to)*gel/t_el+(g_f-gel)*(1-SQRT(ABS(1-(AR39-t_el)/(cu-t_el)))))))","v":8.5118635748795569E-3},0,{"$f":"AR39","v":29.296550355276707},{"$f":"J31","v":1.5024496447232956},{"$f":"AU39+AV39","v":30.799000000000003},{"$f":"IF(AW39<t_el,(AW39-t)*gel/t_el,(IF(to>t_el,(g_f-gel)*(SQRT(1-(to-t_el)/(cu-t_el))-SQRT(1-(AW39-t_el)/(cu-t_el))),(t_el-to)*gel/t_el+(g_f-gel)*(1-SQRT(ABS(1-(AW39-t_el)/(cu-t_el)))))))","v":1.455850451766327E-2},0,{"$f":"c_peak","v":30.800000000000004},{"$f":"K31","v":-0.93940879289195123},{"$f":"AZ39+BA39","v":29.860591207108055},{"$f":"IF(to>t_el,(g_f-gel)*(SQRT(1-(to-t_el)/(cu-t_el))-SQRT(1-(ABS(tmax-t_el))/(cu-t_el)))-(tmax-BB39)*gel/t_el,(t_el-to)*gel/t_el+(g_f-gel)*(1-SQRT(1-(ABS(tmax-t_el))/(cu-t_el)))+(BB39-tmax)*gel/t_el)","v":1.4100545115242303E-2},0,{"$f":"BB39","v":29.860591207108055},{"$f":"L31","v":-0.93940879289195123},{"$f":"BE39+BF39","v":28.921182414216105},{"$f":"IF(to>t_el,(g_f-gel)*(SQRT(1-(to-t_el)/(cu-t_el))-SQRT(1-(ABS(tmax-t_el))/(cu-t_el)))-(tmax-BG39)*gel/t_el,(t_el-to)*gel/t_el+(g_f-gel)*(1-SQRT(1-(ABS(tmax-t_el))/(cu-t_el)))+(BG39-tmax)*gel/t_el)","v":1.3482513014655494E-2},0,{"$f":"BG39","v":28.921182414216105},{"$f":"M31","v":-0.93940879289195123},{"$f":"BJ39+BK39","v":27.981773621324155},{"$f":"IF(to>t_el,(g_f-gel)*(SQRT(1-(to-t_el)/(cu-t_el))-SQRT(1-(ABS(tmax-t_el))/(cu-t_el)))-(tmax-BL39)*gel/t_el,(t_el-to)*gel/t_el+(g_f-gel)*(1-SQRT(1-(ABS(tmax-t_el))/(cu-t_el)))+(BL39-tmax)*gel/t_el)","v":1.2864480914068685E-2},0,{"$f":"BL39","v":27.981773621324155},{"$f":"N31","v":-0.93940879289195123},{"$f":"BO39+BP39","v":27.042364828432206},{"$f":"IF(to>t_el,(g_f-gel)*(SQRT(1-(to-t_el)/(cu-t_el))-SQRT(1-(ABS(tmax-t_el))/(cu-t_el)))-(tmax-BQ39)*gel/t_el,(t_el-to)*gel/t_el+(g_f-gel)*(1-SQRT(1-(ABS(tmax-t_el))/(cu-t_el)))+(BQ39-tmax)*gel/t_el)","v":1.2246448813481876E-2},0,{"$f":"BQ39","v":27.042364828432206},{"$f":"O31","v":-0.93940879289195123},{"$f":"BT39+BU39","v":26.102956035540256},{"$f":"IF(to>t_el,(g_f-gel)*(SQRT(1-(ABS(to-t_el))/(cu-t_el))-SQRT(1-(ABS(tmax-t_el))/(cu-t_el)))-(tmax-BV39)*gel/t_el,(t_el-to)*gel/t_el+(g_f-gel)*(1-SQRT(1-(ABS(tmax-t_el))/(cu-t_el)))+(BV39-tmax)*gel/t_el)","v":1.1628416712895067E-2},0,{"$f":"BV39","v":26.102956035540256},{"$f":"P31","v":-0.93940879289195123},{"$f":"BY39+BZ39","v":25.163547242648306},{"$f":"IF(to>t_el,(g_f-gel)*(SQRT(1-(ABS(to-t_el))/(cu-t_el))-SQRT(1-(ABS(tmax-t_el))/(cu-t_el)))-(tmax-CA39)*gel/t_el,(t_el-to)*gel/t_el+(g_f-gel)*(1-SQRT(1-(ABS(tmax-t_el))/(cu-t_el)))+(CA39-tmax)*gel/t_el)","v":1.1010384612308258E-2},0,{"$f":"CA39","v":25.163547242648306},{"$f":"Q31","v":-0.93940879289195123},{"$f":"CD39+CE39","v":24.224138449756357},{"$f":"IF(to>t_el,(g_f-gel)*(SQRT(1-(ABS(to-t_el))/(cu-t_el))-SQRT(1-(ABS(tmax-t_el))/(cu-t_el)))-(tmax-CF39)*gel/t_el,(t_el-to)*gel/t_el+(g_f-gel)*(1-SQRT(1-(ABS(tmax-t_el))/(cu-t_el)))+(CF39-tmax)*gel/t_el)","v":1.039235251172145E-2},0,{"$f":"CF39","v":24.224138449756357},{"$f":"R31","v":-0.93940879289195123},{"$f":"CI39+CJ39","v":23.284729656864407},{"$f":"IF(to>t_el,(g_f-gel)*(SQRT(1-(ABS(to-t_el))/(cu-t_el))-SQRT(1-(ABS(tmax-t_el))/(cu-t_el)))-(tmax-CK39)*gel/t_el,(t_el-to)*gel/t_el+(g_f-gel)*(1-SQRT(1-(ABS(tmax-t_el))/(cu-t_el)))+(CK39-tmax)*gel/t_el)","v":9.7743204111346398E-3},0,{"$f":"CK39","v":23.284729656864407},{"$f":"S31","v":-0.93940879289195123},{"$f":"CN39+CO39","v":22.345320863972457},{"$f":"IF(to>t_el,(g_f-gel)*(SQRT(1-(ABS(to-t_el))/(cu-t_el))-SQRT(1-(ABS(tmax-t_el))/(cu-t_el)))-(tmax-CP39)*gel/t_el,(t_el-to)*gel/t_el+(g_f-gel)*(1-SQRT(1-(ABS(tmax-t_el))/(cu-t_el)))+(CP39-tmax)*gel/t_el)","v":9.1562883105478325E-3},0,{"$f":"CP39","v":22.345320863972457},{"$f":"T31","v":-7.3453208639724572},{"$f":"CS39+CT39","v":15},{"$f":"IF(to>t_el,(g_f-gel)*(SQRT(1-(ABS(to-t_el))/(cu-t_el))-SQRT(1-(ABS(tmax-t_el))/(cu-t_el)))-(tmax-CU39)*gel/t_el,(t_el-to)*gel/t_el+(g_f-gel)*(1-SQRT(1-(ABS(tmax-t_el))/(cu-t_el)))+(CU39-tmax)*gel/t_el)","v":4.3238403737238477E-3},0,{"$f":"CU39","v":15},{"$f":"U31","v":0},{"$f":"CX39+CY39","v":15},{"$f":"IF(to>t_el,(g_f-gel)*(SQRT(1-(ABS(to-t_el))/(cu-t_el))-SQRT(1-(ABS(tmax-t_el))/(cu-t_el)))-(tmax-CZ39)*gel/t_el,(t_el-to)*gel/t_el+(g_f-gel)*(1-SQRT(1-(ABS(tmax-t_el))/(cu-t_el)))+(CZ39-tmax)*gel/t_el)","v":4.3238403737238477E-3},0]
[{"$f":"IF(A39<Height/3,A39+1,\"\")","v":1},{"$f":"$B$39*(1-(z-$A$39)/Height)","v":21.228054820773821},16,15.615584415584415,30.060000000000002,{"$f":"$F$39*(1-(z-$A$39)/Height)","v":29.26},{"$f":"$G$39*(1-(z-$A$39)/Height)","v":21.228054820773821},{"$f":"$H$39*(1-(z-$A$39)/Height)","v":0.47499999999999998},21.703054820773822,4.1513972602361446E-4,{"$f":"(z-$A39)*AVERAGE(J39:J40)","v":4.2849589766606711E-4},{"$f":"L$39*(1-(z-$A$39)/Height)","v":21.703054820773819},0.8031945179226182,22.506249338696438,1.1449294805041029E-3,{"$f":"(z-$A39)*AVERAGE(O39:O40)","v":1.1833974487000377E-3},{"$f":"Q$39*(1-(z-$A$39)/Height)","v":22.506249338696438},0.84312668565795912,{"$f":"Q40+R40","v":23.349376024354399},1.9540989965284561E-3,{"$f":"(z-$A39)*AVERAGE(T39:T40)","v":2.023245897351986E-3},{"$f":"V$39*(1-(z-$A$39)/Height)","v":23.349376024354395},0.86739961177277647,24.216775636127171,2.8416096073977343E-3,{"$f":"(z-$A39)*AVERAGE(Y39:Y40)","v":2.9486023821812734E-3},{"$f":"AA$39*(1-(z-$A$39)/Height)","v":24.216775636127174},0.88504414834298106,{"$f":"AA40+AB40","v":25.101819784470155},3.8181120831347532E-3,{"$f":"(z-$A39)*AVERAGE(AD39:AD40)","v":3.9732086252492289E-3},{"$f":"AF$39*(1-(z-$A$39)/Height)","v":25.101819784470152},0.8989771144639368,26.000796898934087,4.9041202185507102E-3,{"$f":"(z-$A39)*AVERAGE(AI39:AI40)","v":5.123418054863476E-3},{"$f":"AK$39*(1-(z-$A$39)/Height)","v":26.000796898934087},0.910523843846055,{"$f":"AK40+AL40","v":26.911320742780141},6.1353585648452726E-3,{"$f":"(z-$A39)*AVERAGE(AN39:AN40)","v":6.4473871238259831E-3},{"$f":"AP$39*(1-(z-$A$39)/Height)","v":26.911320742780145},0.9204020947327255,27.831722837512871,7.5788057657613381E-3,{"$f":"(z-$A39)*AVERAGE(AS39:AS40)","v":8.0453346703204479E-3},{"$f":"AU$39*(1-(z-$A$39)/Height)","v":27.831722837512871},1.4273271624871307,{"$f":"AU40+AV40","v":29.259050000000002},1.0641770390435536E-2,{"$f":"(z-$A39)*AVERAGE(AX39:AX40)","v":1.2600137454049403E-2},{"$f":"AZ$39*(1-(z-$A$39)/Height)","v":29.26},-0.89243835324735366,{"$f":"AZ40+BA40","v":28.367561646752648},1.0042906556686168E-2,{"$f":"(z-$A39)*AVERAGE(BC39:BC40)","v":1.2071725835964235E-2},{"$f":"BE$39*(1-(z-$A$39)/Height)","v":28.367561646752652},-0.89243835324735366,27.475123293505298,9.4413224161948184E-3,{"$f":"(z-$A39)*AVERAGE(BH39:BH40)","v":1.1461917715425155E-2},{"$f":"BJ$39*(1-(z-$A$39)/Height)","v":27.475123293505298},-0.89243835324735366,{"$f":"BJ40+BK40","v":26.582684940257945},8.839738275703465E-3,{"$f":"(z-$A39)*AVERAGE(BM39:BM40)","v":1.0852109594886075E-2},{"$f":"BO$39*(1-(z-$A$39)/Height)","v":26.582684940257945},-0.89243835324735366,25.690246587010591,8.2381541352121133E-3,{"$f":"(z-$A39)*AVERAGE(BR39:BR40)","v":1.0242301474346995E-2},{"$f":"BT$39*(1-(z-$A$39)/Height)","v":25.690246587010595},-0.89243835324735366,{"$f":"BT40+BU40","v":24.797808233763242},7.6365699947207625E-3,{"$f":"(z-$A39)*AVERAGE(BW39:BW40)","v":9.6324933538079142E-3},{"$f":"BY$39*(1-(z-$A$39)/Height)","v":24.797808233763242},-0.89243835324735366,23.905369880515888,7.03498585422941E-3,{"$f":"(z-$A39)*AVERAGE(CB39:CB40)","v":9.0226852332688338E-3},{"$f":"CD$39*(1-(z-$A$39)/Height)","v":23.905369880515888},-0.89243835324735366,{"$f":"CD40+CE40","v":23.012931527268535},6.4334017137380574E-3,{"$f":"(z-$A39)*AVERAGE(CG39:CG40)","v":8.4128771127297535E-3},{"$f":"CI$39*(1-(z-$A$39)/Height)","v":23.012931527268538},-0.89243835324735366,22.120493174021185,5.8318175732467083E-3,{"$f":"(z-$A39)*AVERAGE(CL39:CL40)","v":7.803068992190674E-3},{"$f":"CN$39*(1-(z-$A$39)/Height)","v":22.120493174021185},-0.89243835324735366,{"$f":"CN40+CO40","v":21.228054820773831},5.2302334327553558E-3,{"$f":"(z-$A39)*AVERAGE(CQ39:CQ40)","v":7.1932608716515946E-3},{"$f":"CS$39*(1-(z-$A$39)/Height)","v":21.228054820773835},-6.978054820773834,{"$f":"CS40+CT40","v":14.25},5.2639355812229838E-4,{"$f":"(z-$A39)*AVERAGE(CV39:CV40)","v":2.425116965923073E-3},{"$f":"CX$39*(1-(z-$A$39)/Height)","v":14.25},0,{"$f":"CX40+CY40","v":14.25},5.2639355812229838E-4,{"$f":"(z-$A39)*AVERAGE(DA39:DA40)","v":2.425116965923073E-3}]
[2,20.110788777575198,16,15.231168831168832,29.320000000000004,27.720000000000006,20.110788777575198,0.45,20.560788777575198,3.8948186284183689E-4,4.0231079443272567E-4,20.560788777575198,0.76092112224248054,21.321709899817677,1.0715734142900282E-3,1.1082514473970656E-3,21.32170989981768,0.79875159693911923,22.1204614967568,1.823484901140151E-3,1.8887919488343036E-3,22.1204614967568,0.82174700062684092,22.942208497383639,2.6419981520867056E-3,2.7418038797422202E-3,22.942208497383639,0.83846287737756109,23.780671374761202,3.5335837727347203E-3,3.6758479279347367E-3,23.780671374761198,0.85166252949215071,24.63233390425335,4.511421124174189E-3,4.70777067136245E-3,24.63233390425335,0.86260153627521008,25.494935440528561,5.5974240502982085E-3,5.866391307571741E-3,25.494935440528561,0.87195987922047691,26.366895319749037,6.8286562175020969E-3,7.2037309916317179E-3,26.366895319749037,1.352204680250966,27.719100000000005,9.1798803385871718E-3,9.9108253645113532E-3,27.720000000000006,-0.84546791360275608,26.874532086397249,8.5974198591650345E-3,9.3201632079256014E-3,26.874532086397249,-0.84546791360275608,26.029064172794492,8.013113930506563E-3,8.7272181733506898E-3,26.029064172794495,-0.84546791360275608,25.183596259191738,7.4288080018480931E-3,8.13427313877578E-3,25.183596259191741,-0.84546791360275608,24.338128345588984,6.8445020731896242E-3,7.5413281042008683E-3,24.338128345588984,-0.84546791360275608,23.492660431986227,6.2601961445311518E-3,6.9483830696259567E-3,23.492660431986231,-0.84546791360275608,22.647192518383473,5.6758902158726837E-3,6.3554380350510468E-3,22.647192518383477,-0.84546791360275608,21.80172460478072,5.0915842872142139E-3,5.7624930004761352E-3,21.80172460478072,-0.84546791360275608,20.956256691177963,4.5072783585557424E-3,5.1695479659012254E-3,20.956256691177966,-0.84546791360275608,20.110788777575209,3.9229724298972726E-3,4.5766029313263137E-3,20.110788777575213,-6.6107887775752117,13.5,-6.4576757040152657E-4,-5.9687006139614099E-5,13.5,0,13.5,-6.4576757040152657E-4,-5.9687006139614099E-5]
[3,18.993522734376576,16,14.846753246753247,28.580000000000005,26.180000000000003,18.993522734376576,0.42499999999999999,19.418522734376577,3.6474252535954844E-4,3.7711219410069264E-4,19.418522734376577,0.71864772656234266,20.137170460938918,1.0013088037909303E-3,1.0364411090404793E-3,20.137170460938918,0.75437650822027924,20.891546969159197,1.6994110572245739E-3,1.7614479791823625E-3,20.891546969159197,0.77609438948090526,21.667641358640104,2.4543748099909836E-3,2.5481864810388446E-3,21.667641358640104,0.791881606412141,22.459522965052244,3.2698072887086208E-3,3.4016955307216703E-3,22.459522965052241,0.80434794452036451,23.263870909572606,4.1541302757835026E-3,4.3327756999788462E-3,23.263870909572606,0.81467922870436504,24.07855013827697,5.1210841141404312E-3,5.3592540822193198E-3,24.07855013827697,0.8235176637082281,24.902067801985197,6.1923853068794202E-3,6.510520762190759E-3,24.902067801985201,1.2770821980148013,26.179150000000003,8.1278880873593817E-3,8.6538842129732767E-3,26.180000000000003,-0.79849747395815851,25.381502526041846,7.5631965860207774E-3,8.0803082225929055E-3,25.381502526041846,-0.79849747395815851,24.583005052083688,6.9970636121452464E-3,7.5050887713259042E-3,24.583005052083688,-0.79849747395815851,23.784507578125531,6.4309306382697162E-3,6.9298693200589047E-3,23.784507578125531,-0.79849747395815851,22.986010104167374,5.8647976643941852E-3,6.3546498687919051E-3,22.986010104167374,-0.79849747395815851,22.187512630209216,5.2986646905186559E-3,5.7794304175249039E-3,22.187512630209216,-0.79849747395815851,21.389015156251059,4.7325317166431249E-3,5.2042109662579043E-3,21.389015156251059,-0.79849747395815851,20.590517682292901,4.1663987427675948E-3,4.6289915149909048E-3,20.590517682292901,-0.79849747395815851,19.792020208334744,3.6002657688920638E-3,4.0537720637239035E-3,19.792020208334744,-0.79849747395815851,18.993522734376587,3.0341327950165337E-3,3.4785526124569031E-3,18.993522734376587,-6.2435227343765884,12.749999999999998,-1.3925112562798939E-3,-1.0191394133407103E-3,12.75,0,12.75,-1.3925112562798922E-3,-1.0191394133407094E-3]
[4,17.876256691177954,16,14.462337662337662,27.840000000000003,24.640000000000004,17.876256691177954,0.4,18.276256691177952,3.4080237227763479E-4,3.5277244881859162E-4,18.276256691177956,0.67637433088220489,18.95263102206016,9.337165540301473E-4,9.6751267891053881E-4,18.95263102206016,0.71000141950143936,19.662632441561598,1.5809284183540369E-3,1.6401697377893053E-3,19.662632441561598,0.7304417783349697,20.393074219896569,2.2768289528152666E-3,2.3656018814031251E-3,20.393074219896569,0.74530033544672092,21.13837455534329,3.0230528206819799E-3,3.1464300546953003E-3,21.13837455534329,0.75703335954857842,21.895407914891869,3.824864731477742E-3,3.9894975036306223E-3,21.895407914891866,0.76675692113352012,22.662164836025386,4.6909474718798581E-3,4.9060157930101451E-3,22.662164836025386,0.77507544819597951,23.437240284221367,5.6344583883246894E-3,5.9134218476020548E-3,23.437240284221367,1.2019597157786366,24.639200000000002,7.2807012222360105E-3,7.7042946547976957E-3,24.640000000000004,-0.75152703431356105,23.888472965686443,6.7348977570415684E-3,7.1490471715311733E-3,23.888472965686447,-0.75152703431356105,23.136945931372885,6.187903828936003E-3,6.5924837205406251E-3,23.136945931372885,-0.75152703431356105,22.385418897059324,5.6409099008304358E-3,6.035920269550076E-3,22.385418897059324,-0.75152703431356105,21.633891862745763,5.0939159727248686E-3,5.4793568185595269E-3,21.633891862745767,-0.75152703431356105,20.882364828432205,4.5469220446193032E-3,4.9227933675689796E-3,20.882364828432205,-0.75152703431356105,20.130837794118644,3.999928116513736E-3,4.3662299165784305E-3,20.130837794118648,-0.75152703431356105,19.379310759805087,3.452934188408171E-3,3.8096664655878831E-3,19.379310759805087,-0.75152703431356105,18.627783725491526,2.9059402603026033E-3,3.2531030145973336E-3,18.627783725491526,-0.75152703431356105,17.876256691177964,2.3589463321970353E-3,2.6965395636067845E-3,17.876256691177968,-5.8762566911779661,12.000000000000002,-1.9180478187851083E-3,-1.6552795375325011E-3,12,0,12,-1.9180478187851117E-3,-1.655279537532502E-3]
[5,16.758990647979331,16,14.077922077922077,27.1,23.1,16.758990647979331,0.375,17.133990647979331,3.1755552889560658E-4,3.2917895058662066E-4,17.133990647979331,0.63410093520206701,17.768091583181398,8.6843271198784534E-4,9.0107463300899632E-4,17.768091583181402,0.66562633078259936,18.433717913964003,1.4672348467422965E-3,1.5240816325481667E-3,18.433717913963999,0.68478916718903404,19.118507081153034,2.1078005391599796E-3,2.1923147459876231E-3,19.118507081153034,0.69871906448130083,19.817226145634336,2.7904086403776891E-3,2.9067307305298343E-3,19.817226145634333,0.70971877457679222,20.526944920211125,3.5181978099662501E-3,3.671531270721996E-3,20.526944920211122,0.71883461356267508,21.245779533773796,4.2966211717657306E-3,4.4937843218227948E-3,21.245779533773799,0.7266332326837307,21.972412766457531,5.1337829316565435E-3,5.3841206599906169E-3,21.972412766457531,1.1268372335424717,23.099250000000001,6.5596871117753024E-3,6.9201941670056569E-3,23.1,-0.70455659466896337,22.395443405331037,6.0338892479916105E-3,6.3843935025165895E-3,22.39544340533104,-0.70455659466896337,21.690886810662075,5.5070795976759181E-3,5.847491713305961E-3,21.690886810662079,-0.70455659466896337,20.986330215993114,4.9802699473602248E-3,5.3105899240953307E-3,20.986330215993117,-0.70455659466896337,20.281773621324152,4.4534602970445324E-3,4.7736881348847005E-3,20.281773621324156,-0.70455659466896337,19.577217026655191,3.92665064672884E-3,4.236786345674072E-3,19.577217026655191,-0.70455659466896337,18.872660431986226,3.3998409964131446E-3,3.6998845564634401E-3,18.87266043198623,-0.70455659466896337,18.168103837317265,2.8730313460974522E-3,3.1629827672528116E-3,18.168103837317268,-0.70455659466896337,17.463547242648303,2.3462216957817594E-3,2.6260809780421814E-3,17.463547242648303,-0.70455659466896337,16.758990647979338,1.8194120454660644E-3,2.0891791888315498E-3,16.758990647979342,-5.5089906479793429,11.25,-2.2997594431182142E-3,-2.1089036309516612E-3,11.25,0,11.25,-2.2997594431182142E-3,-2.108903630951663E-3]
[6,15.641724604780709,16,13.693506493506494,26.360000000000003,21.560000000000002,15.641724604780709,0.35,15.991724604780709,2.9490704789649061E-4,3.0623128839604859E-4,15.991724604780709,0.59182753952192924,16.583552144302637,8.0513742512505532E-4,8.3678506855645028E-4,16.58355214430264,0.62125124206375937,17.2048033863664,1.3576427979352865E-3,1.4124388223387915E-3,17.204803386366397,0.63913655604309849,17.843939942409495,1.945993008027244E-3,2.0268967735936117E-3,17.843939942409495,0.65213779351588075,18.496077735925375,2.5695464466481744E-3,2.6799775435129318E-3,18.496077735925375,0.66240418960500602,19.158481925530381,3.2299997296835123E-3,3.3740987698248812E-3,19.158481925530381,0.67091230599182994,19.829394231522212,3.9306987735245168E-3,4.1136599726451237E-3,19.829394231522212,0.678191017171482,20.507585248693694,4.6766435501558196E-3,4.9052132409061816E-3,20.507585248693694,1.0517147513063068,21.5593,5.9248764614656113E-3,6.2422817866204568E-3,21.560000000000002,-0.65758615502436579,20.902413844975637,5.4202584295110524E-3,5.7270738387513315E-3,20.902413844975637,-0.65758615502436579,20.244827689951272,4.9147663168914923E-3,5.2109229572837052E-3,20.244827689951272,-0.65758615502436579,19.587241534926907,4.4092742042719322E-3,4.6947720758160789E-3,19.587241534926907,-0.65758615502436579,18.929655379902542,3.9037820916523716E-3,4.1786211943484518E-3,18.929655379902542,-0.65758615502436579,18.272069224878177,3.3982899790328115E-3,3.6624703128808256E-3,18.272069224878177,-0.65758615502436579,17.614483069853812,2.8927978664132514E-3,3.146319431413198E-3,17.614483069853812,-0.65758615502436579,16.956896914829446,2.3873057537936913E-3,2.6301685499455717E-3,16.95689691482945,-0.65758615502436579,16.299310759805085,1.8818136411741342E-3,2.1140176684779468E-3,16.299310759805085,-0.65758615502436579,15.64172460478072,1.376321528554574E-3,1.5978667870103192E-3,15.64172460478072,-5.1417246047807197,10.5,-2.5761662376793072E-3,-2.4379628403987607E-3,10.5,0,10.5,-2.5761662376793072E-3,-2.4379628403987607E-3]
[6.67,14.893156355837633,16,13.435948051948053,25.864200000000004,20.528200000000002,14.893156355837633,0.33324999999999999,15.226406355837632,2.8002413980975549E-4,1.926019478815924E-4,15.226406355837632,0.56350436441623686,15.78991072025387,7.6369919615797426E-4,5.2556026812981479E-4,15.78991072025387,0.59151993262213665,16.381430652876006,1.2862101448404503E-3,8.8569073582987171E-4,16.381430652876006,0.60854930657532158,16.989979959451325,1.8410693928167174E-3,1.2686659042827268E-3,16.989979959451329,0.62092834196904934,17.610908301420377,2.4271992325204084E-3,1.6739098025214752E-3,17.610908301420377,0.63070341767390936,18.241611719094287,3.0456001289469619E-3,2.1023259526412085E-3,18.241611719094283,0.63880435991936391,18.880416079013646,3.6986234643564962E-3,2.5558229496901392E-3,18.880416079013649,0.64573473277827531,19.526150811791926,4.3898619566105314E-3,3.0372793447667268E-3,19.526150811791926,1.0013826882080765,20.527533500000001,5.5356532667219308E-3,3.8392774589428263E-3,20.528200000000002,-0.62611596046248552,19.902084039537517,5.0459232167784102E-3,3.5061708515069698E-3,19.902084039537517,-0.62611596046248552,19.275968079075032,4.5553962889296404E-3,3.1725044729500793E-3,19.275968079075032,-0.62611596046248552,18.649852118612547,4.0648693610808705E-3,2.8388380943931888E-3,18.64985211861255,-0.62611596046248552,18.023736158150065,3.5743424332321042E-3,2.5051717158362991E-3,18.023736158150065,-0.62611596046248552,17.39762019768758,3.0838155053833347E-3,2.1715053372794086E-3,17.39762019768758,-0.62611596046248552,16.771504237225095,2.5932885775345653E-3,1.8378389587225185E-3,16.771504237225095,-0.62611596046248552,16.14538827676261,2.1027616496857963E-3,1.5041725801656282E-3,16.14538827676261,-0.62611596046248552,15.519272316300125,1.6122347218370265E-3,1.1705062016087388E-3,15.519272316300126,-0.62611596046248552,14.893156355837641,1.1217077939882593E-3,8.3683982305184903E-4,14.893156355837643,-4.8956563558376427,9.9975000000000005,-2.7137658621352668E-3,-1.7721272534378821E-3,9.9975000000000005,0,9.9975000000000005,-2.7137658621352668E-3,-1.7721272534378821E-3]
[""]
["",null,null,null,null,null,null,null,null,null,null,null,null,null,null,null,null,null,null,null,null,null,null,null,null,null,null,null,null,null,null,null,null,null,null,null,null,null,null,null,null,null,null,null,null,null,null,null,null,null,null,null,null," d (x)",{"$f":"def_cR*($E$39-BB$39)/($E$39-cR)","v":1.189125054293607E-2},null,null,null," d (x)",{"$f":"def_cR*($E$39-BG$39)/($E$39-cR)","v":2.378250108587214E-2},null,null,null," d (x)",{"$f":"def_cR*($E$39-BL$39)/($E$39-cR)","v":3.567375162880821E-2},null,null,null," d (x)",{"$f":"def_cR*($E$39-BQ$39)/($E$39-cR)","v":4.7565002171744281E-2},null,null,null," d (x)",{"$f":"def_cR*($E$39-BV$39)/($E$39-cR)","v":5.9456252714680344E-2},null,null,null," d (x)",{"$f":"def_cR*($E$39-CA$39)/($E$39-cR)","v":7.1347503257616421E-2},null,null,null," d (x)",{"$f":"def_cR*($E$39-CF$39)/($E$39-cR)","v":8.3238753800552484E-2},null,null,null," d (x)",{"$f":"def_cR*($E$39-CK$39)/($E$39-cR)","v":9.5130004343488561E-2},null,null,null," d (x)",{"$f":"def_cR*($E$39-CP$39)/($E$39-cR)","v":0.10702125488642462},null,null,null," d (x)",{"$f":"def_cR*($E$39-CU$39)/($E$39-cR)","v":0.2},null,null,null," d (x)",{"$f":"def_cR*($E$39-CZ$39)/($E$39-cR)","v":0.2}]
[null,null,null,null,null,null,null,null,null,null,null,null,null,null,null,null,null,null,null,null,null,null,null,null,null,null,null,null,null,null,null,null,null,null,null,null,null,null,null,null,null,null,null,null,null,null,null,null,null,null,null,null,null," d (slip)",{"$f":"IF((BB39-cR)<1,IF((BC53-BC48-SUM(BD39:BD46))<0,BC53-BC48-SUM(BD39:BD46),0),0)","v":0},null,null,null," d (slip)",{"$f":"IF((BG39-cR)<1,IF((BH53-BH48-SUM(BI39:BI46))<0,BH53-BH48-SUM(BI39:BI46),0),0)","v":0},null,null,null," d (slip)",{"$f":"IF((BL39-cR)<1,IF((BM53-BM48-SUM(BN39:BN46))<0,BM53-BM48-SUM(BN39:BN46),0),0)","v":0},null,null,null," d (slip)",{"$f":"IF((BQ39-cR)<1,IF((BR53-BR48-SUM(BS39:BS46))<0,BR53-BR48-SUM(BS39:BS46),0),0)","v":0},null,null,null," d (slip)",{"$f":"IF((BV39-cR)<1,IF((BW53-BW48-SUM(BX39:BX46))<0,BW53-BW48-SUM(BX39:BX46),0),0)","v":0},null,null,null," d (slip)",{"$f":"IF((CA39-cR)<1,IF((CB53-CB48-SUM(CC39:CC46))<0,CB53-CB48-SUM(CC39:CC46),0),0)","v":0},null,null,null," d (slip)",{"$f":"IF((CF39-cR)<1,IF((CG53-CG48-SUM(CH39:CH46))<0,CG53-CG48-SUM(CH39:CH46),0),0)","v":0},null,null,null," d (slip)",{"$f":"IF((CK39-cR)<1,IF((CL53-CL48-SUM(CM39:CM46))<0,CL53-CL48-SUM(CM39:CM46),0),0)","v":0},null,null,null," d (slip)",{"$f":"IF((CP39-cR)<1,IF((CQ53-CQ48-SUM(CR39:CR46))<0,CQ53-CQ48-SUM(CR39:CR46),0),0)","v":0},null,null,null," d (slip)",{"$f":"IF((CU39-cR)<=1,IF((CV53-CV48-SUM(CW39:CW46))<0,CV53-CV48-SUM(CW39:CW46),0),0)","v":-6.388172416982163E-2},null,null,null," d (slip)",{"$f":"DA53-SUM(DB39:DB46)-DA48","v":1.5135708867799108E-2}]
["D N",null,null,null,null,null,null,null,"D N",{"$f":"(((I39+G39)/2)-$B$39)*$B$30","v":9.0964565147526262},null,null,null,"D N",{"$f":"(((N39+L39)/2)-$B$39)*C30","v":15.724546548005129},null,null,null,"D N",{"$f":"(((S39+Q39)/2)-$B$39)*D30","v":17.021260885617803},null,null,null,"D N",{"$f":"(((X39+V39)/2)-$B$39)*E30","v":18.141356501178837},null,null,null,"D N",{"$f":"(((AC39+AA39)/2)-$B$39)*F30","v":19.286193438453218},null,null,null,"D N",{"$f":"(((AH39+AF39)/2)-$B$39)*G30","v":20.576632358754889},null,null,null,"D N",{"$f":"(((AM39+AK39)/2)-$B$39)*H30","v":22.135861784956948},null,null,null,"D N",{"$f":"(((AR39+AP39)/2)-$B$39)*I30","v":24.250648699232567},null,null,null,"D N",{"$f":"(((AW39+AU39)/2)-$B$39)*J30","v":46.792250799617037},null,null,null,"D N",{"$f":"(((BB39+AZ39)/2)-$B$39)*K30","v":22.373471644984058},null,null,null,"D N",{"$f":"(((BG39+BE39)/2)-$B$39)*L30","v":17.785926633477835},null,null,null,"D N",{"$f":"(((BL39+BJ39)/2)-$B$39)*M30","v":14.377679256482748},null,null,null,"D N",{"$f":"(((BQ39+BO39)/2)-$B$39)*N30","v":11.544325678641227},null,null,null,"D N",{"$f":"(((BV39+BT39)/2)-$B$39)*O30","v":9.0775636623688758},null,null,null,"D N",{"$f":"(((CA39+BY39)/2)-$B$39)*P30","v":6.8530461784306622},null,null,null,"D N",{"$f":"(((CF39+CD39)/2)-$B$39)*Q30","v":4.7904484702559893},null,null,null,"D N",{"$f":"(((CK39+CI39)/2)-$B$39)*R30","v":2.8368533613918561},null,null,null,"D N",{"$f":"(((CP39+CN39)/2)-$B$39)*S30","v":0.93913796826323082},null,null,null,"D N",{"$f":"(((CU39+CS39)/2)-$B$39)*T30","v":-6.7911303194260698E-12},null,null,null,"D N",{"$f":"(((CZ39+CX39)/2)-$B$39)*U30","v":-283.60308317210502}]
["SD N",null,null,null,null,null,null,null,"SD N",{"$f":"J50","v":9.0964565147526262},null,null,null,"SD N",{"$f":"O50+J51","v":24.821003062757754},null,null,null,"SD N",{"$f":"T50+O51","v":41.84226394837556},null,null,null,"SD N",{"$f":"Y50+T51","v":59.983620449554394},null,null,null,"SD N",{"$f":"AD50+Y51","v":79.269813888007604},null,null,null,"SD N",{"$f":"AI50+AD51","v":99.846446246762497},null,null,null,"SD N",{"$f":"AN50+AI51","v":121.98230803171944},null,null,null,"SD N",{"$f":"AS50+AN51","v":146.232956730952},null,null,null,"SD N",{"$f":"AX50+AS51","v":193.02520753056905},null,null,null,"SD N",{"$f":"AX51+BC50","v":215.3986791755531},null,null,null,"SD N",{"$f":"BC51+BH50","v":233.18460580903093},null,null,null,"SD N",{"$f":"BM50+BH51","v":247.56228506551366},null,null,null,"SD N",{"$f":"BR50+BM51","v":259.10661074415486},null,null,null,"SD N",{"$f":"BW50+BR51","v":268.18417440652377},null,null,null,"SD N",{"$f":"CB50+BW51","v":275.03722058495441},null,null,null,"SD N",{"$f":"CG50+CB51","v":279.82766905521038},null,null,null,"SD N",{"$f":"CL50+CG51","v":282.66452241660221},null,null,null,"SD N",{"$f":"CQ50+CL51","v":283.60366038486546},null,null,null,"SD N",{"$f":"CV50+CQ51","v":283.6036603848587},null,null,null,"SD N",{"$f":"DA50+CV51","v":5.77212753682943E-4}]
[" d (N)",null,null,null,null,null,null,null," d (N)",{"$f":"(J50+0)/2*B30/Emean/Height","v":2.3884409681393325E-3},null,null,null," d (N)",{"$f":"(J51+O50/2)*C30/Emean/Height","v":4.1709498551103239E-3},null,null,null," d (N)",{"$f":"(O51+T50/2)*D30/Emean/Height","v":4.5764096626770435E-3},null,null,null," d (N)",{"$f":"(T51+Y50/2)*E30/Emean/Height","v":4.9564086178878961E-3},null,null,null," d (N)",{"$f":"(Y51+AD50/2)*F30/Emean/Height","v":5.3658014896914887E-3},null,null,null," d (N)",{"$f":"(AD51+AI50/2)*G30/Emean/Height","v":5.8442964528463729E-3},null,null,null," d (N)",{"$f":"(AI51+AN50/2)*H30/Emean/Height","v":6.4389046506369216E-3},null,null,null," d (N)",{"$f":"(AN51+AS50/2)*I30/Emean/Height","v":7.2581669601271713E-3},null,null,null," d (N)",{"$f":"(AS51+AX50/2)*J30/Emean/Height","v":1.4872539737037652E-2},null,null,null," d (N)",{"$f":"(AX51+BC50/2)*K30/Emean/Height","v":8.2581162146516986E-3},null,null,null," d (N)",{"$f":"(BC51+BH50/2)*L30/Emean/Height","v":8.171724647448083E-3},null,null,null," d (N)",{"$f":"(BH51+BM50/2)*M30/Emean/Height","v":8.1685942200414186E-3},null,null,null," d (N)",{"$f":"(BM51+BR50/2)*N30/Emean/Height","v":8.1693128664100424E-3},null,null,null," d (N)",{"$f":"(BR51+BW50/2)*O30/Emean/Height","v":8.1707585215194806E-3},null,null,null," d (N)",{"$f":"(BW51+CB50/2)*P30/Emean/Height","v":8.1704858953970567E-3},null,null,null," d (N)",{"$f":"(CB51+CG50/2)*Q30/Emean/Height","v":8.1673057329709579E-3},null,null,null," d (N)",{"$f":"(CG51+CL50/2)*R30/Emean/Height","v":8.1717962661034295E-3},null,null,null," d (N)",{"$f":"(CL51+CQ50/2)*S30/Emean/Height","v":8.1702803555963929E-3},null,null,null," d (N)",{"$f":"(CQ51+CV50/2)*T30/Emean/Height","v":7.5685579592171633E-15},null,null,null," d (N)",{"$f":"(CV51+DA50/2)*U30/Emean/Height","v":7.9017433037620738E-2}]
["S d (N)",null,null,null,null,null,null,null,"S d (N)",{"$f":"J52","v":2.3884409681393325E-3},null,null,null,"S d (N)",{"$f":"O52+J53","v":6.559390823249656E-3},null,null,null,"S d (N)",{"$f":"T52+O53","v":1.1135800485926699E-2},null,null,null,"S d (N)",{"$f":"Y52+T53","v":1.6092209103814595E-2},null,null,null,"S d (N)",{"$f":"AD52+Y53","v":2.1458010593506084E-2},null,null,null,"S d (N)",{"$f":"AI52+AD53","v":2.7302307046352458E-2},null,null,null,"S d (N)",{"$f":"AN52+AI53","v":3.3741211696989376E-2},null,null,null,"S d (N)",{"$f":"AS52+AN53","v":4.0999378657116545E-2},null,null,null,"S d (N)",{"$f":"AX52+AS53","v":5.5871918394154195E-2},null,null,null,"S d (N)",{"$f":"BC52+AX53","v":6.4130034608805897E-2},null,null,null,"S d (N)",{"$f":"BH52+BC53","v":7.2301759256253983E-2},null,null,null,"S d (N)",{"$f":"BM52+BH53","v":8.04703534762954E-2},null,null,null,"S d (N)",{"$f":"BR52+BM53","v":8.8639666342705439E-2},null,null,null,"S d (N)",{"$f":"BW52+BR53","v":9.681042486422492E-2},null,null,null,"S d (N)",{"$f":"CB52+BW53","v":0.10498091075962197},null,null,null,"S d (N)",{"$f":"CG52+CB53","v":0.11314821649259293},null,null,null,"S d (N)",{"$f":"CL52+CG53","v":0.12132001275869636},null,null,null,"S d (N)",{"$f":"CQ52+CL53","v":0.12949029311429275},null,null,null,"S d (N)",{"$f":"CV52+CQ53","v":0.12949029311430033},null,null,null,"S d (N)",{"$f":"DA52+CV53","v":0.20850772615192106}]
["S d (t)",null,null,null,null,null,null,null,"S d (t)",{"$f":"SUM(def)","v":2.3887035218823384E-3},null,null,null,"S d (t)",{"$f":"SUM(P39:P49)","v":6.5590226537433818E-3},null,null,null,"S d (t)",{"$f":"SUM(U39:U49)","v":1.1135866753874788E-2},null,null,null,"S d (t)",{"$f":"SUM(Z39:Z49)","v":1.6092072048229423E-2},null,null,null,"S d (t)",{"$f":"SUM(AE39:AE49)","v":2.145780021516518E-2},null,null,null,"S d (t)",{"$f":"SUM(AJ39:AJ49)","v":2.7301417923023479E-2},null,null,null,"S d (t)",{"$f":"SUM(AO39:AO49)","v":3.3742315550785246E-2},null,null,null,"S d (t)",{"$f":"SUM(AT39:AT49)","v":4.0999621517408505E-2},null,null,null,"S d (t)",{"$f":"SUM(AY39:AY49)","v":5.5870895098900669E-2},null,null,null,"S d (t)",{"$f":"SUM(BD39:BD47)+BC48+BC49","v":6.4130133173724874E-2},null,null,null,"S d (t)",{"$f":"SUM(BI39:BI47)+BH48+BH49","v":7.2300128610054248E-2},null,null,null,"S d (t)",{"$f":"SUM(BN39:BN47)+BM48+BM49","v":8.0470124046383651E-2},null,null,null,"S d (t)",{"$f":"SUM(BS39:BS47)+BR48+BR49","v":8.8640119482713026E-2},null,null,null,"S d (t)",{"$f":"SUM(BX39:BX47)+BW48+BW49","v":9.6810114919042414E-2},null,null,null,"S d (t)",{"$f":"SUM(CC39:CC47)+CB48+CB49","v":0.1049801103553718},null,null,null,"S d (t)",{"$f":"SUM(CH39:CH47)+CG48+CG49","v":0.11315010579170118},null,null,null,"S d (t)",{"$f":"SUM(CM39:CM47)+CL48+CL49","v":0.12132010122803057},null,null,null,"S d (t)",{"$f":"SUM(CR39:CR47)+CQ48+CQ49","v":0.12949009666435993},null,null,null,"S d (t)",{"$f":"SUM(CW39:CW47)+CV48+CV49","v":0.12949029311430033},null,null,null,"S d (t)",{"$f":"SUM(DB39:DB47)+DA48+DA49","v":0.20850772615192106}]
["Difference",null,"sum stage I",{"$f":"SUM(I55:AX55)","v":4.3035577937809884E-2},null,null,null,null,null,{"$f":"ABS(J53-J54)*10000","v":2.6255374300588122E-3},null,null,null,null,{"$f":"ABS(O53-O54)*10000","v":3.6816950627419076E-3},null,null,null,null,{"$f":"ABS(T53-T54)*10000","v":6.6267948089018813E-4},null,null,null,null,{"$f":"ABS(Y53-Y54)*10000","v":1.3705558517262961E-3},null,null,null,null,{"$f":"ABS(AD53-AD54)*10000","v":2.1037834090423257E-3},null,null,null,null,{"$f":"ABS(AI53-AI54)*10000","v":8.891233289794187E-3},null,null,null,null,{"$f":"ABS(AN53-AN54)*10000","v":1.1038537958696359E-2},null,null,null,null,{"$f":"ABS(AS53-AS54)*10000","v":2.4286029196018966E-3},null,null,null,null,{"$f":"ABS(AX53-AX54)*10000","v":1.0232952535257911E-2},null,null,null,null,{"$f":"ABS(BC53-BC54)*10000","v":9.8564918976640215E-4},null,null,null,null,{"$f":"ABS(BH53-BH54)*10000","v":1.6306461997350752E-2},null,null,null,null,{"$f":"ABS(BM53-BM54)*10000","v":2.2942991174945693E-3},null,null,null,null,{"$f":"ABS(BR53-BR54)*10000","v":4.5314000758633899E-3},null,null,null,null,{"$f":"ABS(BW53-BW54)*10000","v":3.0994518250559988E-3},null,null,null,null,{"$f":"ABS(CB53-CB54)*10000","v":8.0040425017025019E-3},null,null,null,null,{"$f":"ABS(CG53-CG54)*10000","v":1.8892991082430921E-2},null,null,null,null,{"$f":"ABS(CL53-CL54)*10000","v":8.846933420569858E-4},null,null,null,null,{"$f":"ABS(CQ53-CQ54)*10000","v":1.9644993282108558E-3},null,null,null,null,{"$f":"ABS(CV53-CV54)*10000","v":0},null,null,null,null,{"$f":"ABS(DA53-DA54)*10000","v":0}]
["Compatibility",null,"sum stage II",{"$f":"SUM(BC55:DA55)","v":5.6963488459932377E-2},null,null,null,null,null,{"$f":"IF(ABS(J55)<=0.5,\"Ok\",\"Not ok\")","v":"Ok"},null,null,null,null,{"$f":"IF(ABS(O55)<=0.5,\"Ok\",\"Not ok\")","v":"Ok"},null,null,null,null,{"$f":"IF(ABS(T55)<=0.5,\"Ok\",\"Not ok\")","v":"Ok"},null,null,null,null,{"$f":"IF(ABS(Y55)<=0.5,\"Ok\",\"Not ok\")","v":"Ok"},null,null,null,null,{"$f":"IF(ABS(AD55)<=0.5,\"Ok\",\"Not ok\")","v":"Ok"},null,null,null,null,{"$f":"IF(ABS(AI55)<=0.5,\"Ok\",\"Not ok\")","v":"Ok"},null,null,null,null,{"$f":"IF(ABS(AN55)<=0.5,\"Ok\",\"Not ok\")","v":"Ok"},null,null,null,null,{"$f":"IF(ABS(AS55)<=0.5,\"Ok\",\"Not ok\")","v":"Ok"},null,null,null,null,{"$f":"IF(ABS(AX55)<=0.5,\"Ok\",\"Not ok\")","v":"Ok"},null,null,null,null,{"$f":"IF(ABS(BC55)<=0.5,\"Ok\",\"Not ok\")","v":"Ok"},null,null,null,null,{"$f":"IF(ABS(BH55)<=0.5,\"Ok\",\"Not ok\")","v":"Ok"},null,null,null,null,{"$f":"IF(ABS(BM55)<=0.5,\"Ok\",\"Not ok\")","v":"Ok"},null,null,null,null,{"$f":"IF(ABS(BR55)<=0.5,\"Ok\",\"Not ok\")","v":"Ok"},null,null,null,null,{"$f":"IF(ABS(BW55)<=0.5,\"Ok\",\"Not ok\")","v":"Ok"},null,null,null,null,{"$f":"IF(ABS(CB55)<=0.5,\"Ok\",\"Not ok\")","v":"Ok"},null,null,null,null,{"$f":"IF(ABS(CG55)<=0.5,\"Ok\",\"Not ok\")","v":"Ok"},null,null,null,null,{"$f":"IF(ABS(CL55)<=0.5,\"Ok\",\"Not ok\")","v":"Ok"},null,null,null,null,{"$f":"IF(ABS(CQ55)<=0.5,\"Ok\",\"Not ok\")","v":"Ok"},null,null,null,null,{"$f":"IF(ABS(CV55)<=0.5,\"Ok\",\"Not ok\")","v":"Ok"},null,null,null,null,{"$f":"IF(ABS(DA55)<=0.5,\"Ok\",\"Not ok\")","v":"Ok"}]
[null,null,"Both",{"$f":"D55+D56","v":9.9999066397742253E-2}]
[]
["t(x,z)"]
[null,null,"Stage I",null,null,null,null,null,null,null,null,"Stage II"]
[null,"start value","Dx1","Dx2","Dx3","Dx4","Dx5","Dx6","Dx7","Dx8","Dx9","Dx10","Dx11","Dx12","Dx13","Dx14","Dx15","Dx16","Dx17","Dx18","Dx19","Dx20","SDx"]
["Distance from X=0",0,{"$f":"($B$32+$C$32)/2","v":18},{"$f":"($C$32+$D$32)/2","v":44.5},{"$f":"($D$32+$E$32)/2","v":58},{"$f":"($E$32+$F$32)/2","v":66.5},{"$f":"($F$32+$G$32)/2","v":72.5},{"$f":"($G$32+$H$32)/2","v":77.5},{"$f":"($H$32+$I$32)/2","v":82},{"$f":"($I$32+$J$32)/2","v":85.5},{"$f":"($J$32+$K$32)/2","v":90},{"$f":"($K$32+$L$32)/2","v":94.5},{"$f":"($L$32+$M$32)/2","v":97.5},{"$f":"($M$32+$N$32)/2","v":100},{"$f":"($N$32+$O$32)/2","v":102},{"$f":"($O$32+$P$32)/2","v":104},{"$f":"($P$32+$Q$32)/2","v":106.5},{"$f":"($Q$32+$R$32)/2","v":109},{"$f":"($R$32+$S$32)/2","v":111},{"$f":"($S$32+$T$32)/2","v":113},{"$f":"($T$32+$U$32)/2","v":114}]
["Z från slip surface"]
[0,0,{"$f":"OFFSET($G39,0,(COLUMN(B1)-COLUMN($B$1))*5)","v":22.345320863972443},22.845320863972443,23.6907887775752,24.578290551951998,25.491342774870709,26.422968194179109,27.369259893614831,28.327706045031732,29.296550355276707,30.800000000000004,29.860591207108055,28.921182414216105,27.981773621324155,27.042364828432206,26.102956035540256,25.163547242648306,24.224138449756357,23.284729656864407,22.345320863972457,15]
[{"$f":"IF(A64<Height/3,A64+1,\"\")","v":1},0,21.228054820773821,{"$f":"OFFSET($G40,0,(COLUMN(cS)-COLUMN($B$1))*5)","v":21.703054820773819},22.506249338696438,23.349376024354395,24.216775636127174,25.101819784470152,26.000796898934087,26.911320742780145,27.831722837512871,29.26,28.367561646752652,27.475123293505298,26.582684940257945,25.690246587010595,24.797808233763242,23.905369880515888,23.012931527268538,22.120493174021185,21.228054820773835,14.25]
[2,0,20.110788777575198,{"$f":"OFFSET($G41,0,(COLUMN(C3)-COLUMN($B$1))*5)","v":20.560788777575198},{"$f":"OFFSET($G41,0,(COLUMN(D3)-COLUMN($B$1))*5)","v":21.32170989981768},{"$f":"OFFSET($G41,0,(COLUMN(#REF!)-COLUMN($B$1))*5)","v":{"$error":"#REF!"}},{"$f":"OFFSET($G41,0,(COLUMN(#REF!)-COLUMN($B$1))*5)","v":{"$error":"#REF!"}},{"$f":"OFFSET($G41,0,(COLUMN(#REF!)-COLUMN($B$1))*5)","v":{"$error":"#REF!"}},{"$f":"OFFSET($G41,0,(COLUMN(#REF!)-COLUMN($B$1))*5)","v":{"$error":"#REF!"}},25.494935440528561,26.366895319749037,27.720000000000006,26.874532086397249,26.029064172794495,25.183596259191741,24.338128345588984,23.492660431986231,22.647192518383477,21.80172460478072,20.956256691177966,20.110788777575213,13.5]
[3,0,18.993522734376576,{"$f":"OFFSET($G42,0,(COLUMN(c_peak)-COLUMN($B$1))*5)","v":19.418522734376577},{"$f":"OFFSET($G42,0,(COLUMN(D4)-COLUMN($B$1))*5)","v":20.137170460938918},20.891546969159197,21.667641358640104,22.459522965052241,23.263870909572606,24.07855013827697,24.902067801985201,26.180000000000003,25.381502526041846,24.583005052083688,23.784507578125531,22.986010104167374,22.187512630209216,21.389015156251059,20.590517682292901,19.792020208334744,18.993522734376587,12.75]
[4,0,17.876256691177954,{"$f":"OFFSET($G43,0,(COLUMN(cR)-COLUMN($B$1))*5)","v":18.276256691177956},18.95263102206016,19.662632441561598,20.393074219896569,21.13837455534329,21.895407914891866,22.662164836025386,23.437240284221367,24.640000000000004,23.888472965686447,23.136945931372885,22.385418897059324,21.633891862745767,20.882364828432205,20.130837794118648,19.379310759805087,18.627783725491526,17.876256691177968,12]
[5,0,16.758990647979331,{"$f":"OFFSET($G44,0,(COLUMN(tel)-COLUMN($B$1))*5)","v":17.133990647979331},17.768091583181402,18.433717913963999,19.118507081153034,19.817226145634333,20.526944920211122,21.245779533773799,21.972412766457531,23.1,22.39544340533104,21.690886810662079,20.986330215993117,20.281773621324156,19.577217026655191,18.87266043198623,18.168103837317268,17.463547242648303,16.758990647979342,11.25]
[6,0,15.641724604780709,{"$f":"OFFSET($G45,0,(COLUMN(gel)-COLUMN($B$1))*5)","v":15.991724604780709},16.58355214430264,17.204803386366397,17.843939942409495,18.496077735925375,19.158481925530381,19.829394231522212,20.507585248693694,21.560000000000002,20.902413844975637,20.244827689951272,19.587241534926907,18.929655379902542,18.272069224878177,17.614483069853812,16.95689691482945,16.299310759805085,15.64172460478072,10.5]
[7,0,14.893156355837633,{"$f":"OFFSET($G46,0,(COLUMN(g_f)-COLUMN($B$1))*5)","v":15.226406355837632},15.78991072025387,16.381430652876006,16.989979959451329,17.610908301420377,18.241611719094283,18.880416079013649,19.526150811791926,20.528200000000002,19.902084039537517,19.275968079075032,18.64985211861255,18.023736158150065,17.39762019768758,16.771504237225095,16.14538827676261,15.519272316300126,14.893156355837643,9.9975000000000005]
[""]
[""]
[""]
["Dt"]
[null,null,"Stage I",null,null,null,null,null,null,null,null,"Stage II"]
[null,"start value","Dx1","Dx2","Dx3","Dx4","Dx5","Dx6","Dx7","Dx8","Dx9","Dx10","Dx11","Dx12","Dx13","Dx14","Dx15","Dx16","Dx17","Dx18","Dx19","Dx20","SDx"]
["Distance from X=0",0,{"$f":"($B$32+$C$32)/2","v":18},{"$f":"($C$32+$D$32)/2","v":44.5},{"$f":"($D$32+$E$32)/2","v":58},{"$f":"($E$32+$F$32)/2","v":66.5},{"$f":"($F$32+$G$32)/2","v":72.5},{"$f":"($G$32+$H$32)/2","v":77.5},{"$f":"($H$32+$I$32)/2","v":82},{"$f":"($I$32+$J$32)/2","v":85.5},{"$f":"($J$32+$K$32)/2","v":90},{"$f":"($K$32+$L$32)/2","v":94.5},{"$f":"($L$32+$M$32)/2","v":97.5},{"$f":"($M$32+$N$32)/2","v":100},{"$f":"($N$32+$O$32)/2","v":102},{"$f":"($O$32+$P$32)/2","v":104},{"$f":"($P$32+$Q$32)/2","v":106.5},{"$f":"($Q$32+$R$32)/2","v":109},{"$f":"($R$32+$S$32)/2","v":111},{"$f":"($S$32+$T$32)/2","v":113},{"$f":"($T$32+$U$32)/2","v":114}]
["Z från slip surface"]
[0,0,{"$f":"OFFSET($H39,0,(COLUMN(B$1)-COLUMN($B$1))*5)","v":0.5},0.84546791360275608,0.88750177437679911,0.91305222291871213,0.93162541930840115,0.946291699435723,0.95844615141690004,0.9688443102449743,1.5024496447232956,-0.93940879289195123,-0.93940879289195123,-0.93940879289195123,-0.93940879289195123,-0.93940879289195123,-0.93940879289195123,-0.93940879289195123,-0.93940879289195123,-0.93940879289195123,-7.3453208639724572,0]
[{"$f":"IF(A80<Height/3,A80+1,\"\")","v":1},0,0.47499999999999998,0.8031945179226182,0.84312668565795912,0.86739961177277647,0.88504414834298106,0.8989771144639368,0.910523843846055,0.9204020947327255,1.4273271624871307,-0.89243835324735366,-0.89243835324735366,-0.89243835324735366,-0.89243835324735366,-0.89243835324735366,-0.89243835324735366,-0.89243835324735366,-0.89243835324735366,-0.89243835324735366,-6.978054820773834,0]
[2,0,0.45,0.76092112224248054,0.79875159693911923,0.82174700062684092,0.83846287737756109,0.85166252949215071,0.86260153627521008,0.87195987922047691,1.352204680250966,-0.84546791360275608,-0.84546791360275608,-0.84546791360275608,-0.84546791360275608,-0.84546791360275608,-0.84546791360275608,-0.84546791360275608,-0.84546791360275608,-0.84546791360275608,-6.6107887775752117,0]
[3,0,0.42499999999999999,0.71864772656234266,0.75437650822027924,0.77609438948090526,0.791881606412141,0.80434794452036451,0.81467922870436504,0.8235176637082281,1.2770821980148013,-0.79849747395815851,-0.79849747395815851,-0.79849747395815851,-0.79849747395815851,-0.79849747395815851,-0.79849747395815851,-0.79849747395815851,-0.79849747395815851,-0.79849747395815851,-6.2435227343765884,0]
[4,0,0.4,0.67637433088220489,0.71000141950143936,0.7304417783349697,0.74530033544672092,0.75703335954857842,0.76675692113352012,0.77507544819597951,1.2019597157786366,-0.75152703431356105,-0.75152703431356105,-0.75152703431356105,-0.75152703431356105,-0.75152703431356105,-0.75152703431356105,-0.75152703431356105,-0.75152703431356105,-0.75152703431356105,-5.8762566911779661,0]
[5,0,0.375,0.63410093520206701,0.66562633078259936,0.68478916718903404,0.69871906448130083,0.70971877457679222,0.71883461356267508,0.7266332326837307,1.1268372335424717,-0.70455659466896337,-0.70455659466896337,-0.70455659466896337,-0.70455659466896337,-0.70455659466896337,-0.70455659466896337,-0.70455659466896337,-0.70455659466896337,-0.70455659466896337,-5.5089906479793429,0]
[6,0,0.35,0.59182753952192924,0.62125124206375937,0.63913655604309849,0.65213779351588075,0.66240418960500602,0.67091230599182994,0.678191017171482,1.0517147513063068,-0.65758615502436579,-0.65758615502436579,-0.65758615502436579,-0.65758615502436579,-0.65758615502436579,-0.65758615502436579,-0.65758615502436579,-0.65758615502436579,-0.65758615502436579,-5.1417246047807197,0]
[7,0,0.33324999999999999,0.56350436441623686,0.59151993262213665,0.60854930657532158,0.62092834196904934,0.63070341767390936,0.63880435991936391,0.64573473277827531,1.0013826882080765,-0.62611596046248552,-0.62611596046248552,-0.62611596046248552,-0.62611596046248552,-0.62611596046248552,-0.62611596046248552,-0.62611596046248552,-0.62611596046248552,-0.62611596046248552,-4.8956563558376427,0]
[""]
[""]
[""]
["t+Dt"]
[null,null,"Stage I",null,null,null,null,null,null,null,null,"Stage II"]
[null,null,"Dx1","Dx2","Dx3","Dx4","Dx5","Dx6","Dx7","Dx8","Dx9","Dx10","Dx11","Dx12","Dx13","Dx14","Dx15","Dx16","Dx17","Dx18","Dx19","Dx20","SDx"]
["Distance from x=0",null,{"$f":"($B$32+$C$32)/2","v":18},{"$f":"($C$32+$D$32)/2","v":44.5},{"$f":"($D$32+$E$32)/2","v":58},{"$f":"($E$32+$F$32)/2","v":66.5},{"$f":"($F$32+$G$32)/2","v":72.5},{"$f":"($G$32+$H$32)/2","v":77.5},{"$f":"($H$32+$I$32)/2","v":82},{"$f":"($I$32+$J$32)/2","v":85.5},{"$f":"($J$32+$K$32)/2","v":90},{"$f":"($K$32+$L$32)/2","v":94.5},{"$f":"($L$32+$M$32)/2","v":97.5},{"$f":"($M$32+$N$32)/2","v":100},{"$f":"($N$32+$O$32)/2","v":102},{"$f":"($O$32+$P$32)/2","v":104},{"$f":"($P$32+$Q$32)/2","v":106.5},{"$f":"($Q$32+$R$32)/2","v":109},{"$f":"($R$32+$S$32)/2","v":111},{"$f":"($S$32+$T$32)/2","v":113},{"$f":"($T$32+$U$32)/2","v":114}]
["Z från slip surface"]
[0,null,{"$f":"OFFSET($I39,0,(COLUMN(B$1)-COLUMN($B$1))*5)","v":22.845320863972443},23.6907887775752,24.578290551951998,25.491342774870709,26.422968194179109,27.369259893614831,28.327706045031732,29.296550355276707,30.799000000000003,29.860591207108055,28.921182414216105,27.981773621324155,27.042364828432206,26.102956035540256,25.163547242648306,24.224138449756357,23.284729656864407,22.345320863972457,15,15]
[{"$f":"IF(A96<Height/3,A96+1,\"\")","v":1},null,21.703054820773822,22.506249338696438,23.349376024354399,24.216775636127171,25.101819784470155,26.000796898934087,26.911320742780141,27.831722837512871,29.259050000000002,28.367561646752648,27.475123293505298,26.582684940257945,25.690246587010591,24.797808233763242,23.905369880515888,23.012931527268535,22.120493174021185,21.228054820773831,14.25,14.25]
[2,null,20.560788777575198,21.321709899817677,22.1204614967568,22.942208497383639,23.780671374761202,24.63233390425335,25.494935440528561,26.366895319749037,27.719100000000005,26.874532086397249,26.029064172794492,25.183596259191738,24.338128345588984,23.492660431986227,22.647192518383473,21.80172460478072,20.956256691177963,20.110788777575209,13.5,13.5]
[3,null,19.418522734376577,20.137170460938918,20.891546969159197,21.667641358640104,22.459522965052244,23.263870909572606,24.07855013827697,24.902067801985197,26.179150000000003,25.381502526041846,24.583005052083688,23.784507578125531,22.986010104167374,22.187512630209216,21.389015156251059,20.590517682292901,19.792020208334744,18.993522734376587,12.749999999999998,12.75]
[4,null,18.276256691177952,18.95263102206016,19.662632441561598,20.393074219896569,21.13837455534329,21.895407914891869,22.662164836025386,23.437240284221367,24.639200000000002,23.888472965686443,23.136945931372885,22.385418897059324,21.633891862745763,20.882364828432205,20.130837794118644,19.379310759805087,18.627783725491526,17.876256691177964,12.000000000000002,12]
[5,null,17.133990647979331,17.768091583181398,18.433717913964003,19.118507081153034,19.817226145634336,20.526944920211125,21.245779533773796,21.972412766457531,23.099250000000001,22.395443405331037,21.690886810662075,20.986330215993114,20.281773621324152,19.577217026655191,18.872660431986226,18.168103837317265,17.463547242648303,16.758990647979338,11.25,11.25]
[6,null,15.991724604780709,16.583552144302637,17.2048033863664,17.843939942409495,18.496077735925375,19.158481925530381,19.829394231522212,20.507585248693694,21.5593,20.902413844975637,20.244827689951272,19.587241534926907,18.929655379902542,18.272069224878177,17.614483069853812,16.956896914829446,16.299310759805085,15.64172460478072,10.5,10.5]
[7,null,15.226406355837632,15.78991072025387,16.381430652876006,16.989979959451325,17.610908301420377,18.241611719094287,18.880416079013646,19.526150811791926,20.527533500000001,19.902084039537517,19.275968079075032,18.649852118612547,18.023736158150065,17.39762019768758,16.771504237225095,16.14538827676261,15.519272316300125,14.893156355837641,9.9975000000000005,9.9975000000000005]
[""]
[{"$f":"IF(#REF!<Height/3,#REF!+1,\"\")","v":{"$error":"#REF!"}}]
["g(t)"]
[null,null,"Stage I",null,null,null,null,null,null,null,null,"Stage II"]
[null,"start value","Dx1","Dx2","Dx3","Dx4","Dx5","Dx6","Dx7","Dx8","Dx9","Dx10","Dx11","Dx12","Dx13","Dx14","Dx15","Dx16","Dx17","Dx18","Dx19","Dx20","SDx"]
["Distance from X=0",null,{"$f":"($B$32+$C$32)/2","v":18},{"$f":"($C$32+$D$32)/2","v":44.5},{"$f":"($D$32+$E$32)/2","v":58},{"$f":"($E$32+$F$32)/2","v":66.5},{"$f":"($F$32+$G$32)/2","v":72.5},{"$f":"($G$32+$H$32)/2","v":77.5},{"$f":"($H$32+$I$32)/2","v":82},{"$f":"($I$32+$J$32)/2","v":85.5},{"$f":"($J$32+$K$32)/2","v":90},{"$f":"($K$32+$L$32)/2","v":94.5},{"$f":"($L$32+$M$32)/2","v":97.5},{"$f":"($M$32+$N$32)/2","v":100},{"$f":"($N$32+$O$32)/2","v":102},{"$f":"($O$32+$P$32)/2","v":104},{"$f":"($P$32+$Q$32)/2","v":106.5},{"$f":"($Q$32+$R$32)/2","v":109},{"$f":"($R$32+$S$32)/2","v":111},{"$f":"($S$32+$T$32)/2","v":113},{"$f":"($T$32+$U$32)/2","v":114}]
["Z från slip surface"]
[0,0,{"$f":"OFFSET($J39,0,(COLUMN(B$1)-COLUMN($B$1))*5)","v":4.4185206930851971E-4},{"$f":"OFFSET($J39,0,(COLUMN(C$1)-COLUMN($B$1))*5)","v":1.2218654168959725E-3},2.0923927981755163E-3,3.055595156964813E-3,4.128305167363705E-3,5.3427158911762427E-3,6.7594156828066927E-3,8.5118635748795569E-3,1.455850451766327E-2,1.4100545115242303E-2,1.3482513014655494E-2,1.2864480914068685E-2,1.2246448813481876E-2,1.1628416712895067E-2,1.1010384612308258E-2,1.039235251172145E-2,9.7743204111346398E-3,9.1562883105478325E-3,4.3238403737238477E-3,4.3238403737238477E-3]
[{"$f":"IF(A111<Height/3,A111+1,\"\")","v":1},0,{"$f":"OFFSET($J40,0,(COLUMN(B$1)-COLUMN($B$1))*5)","v":4.1513972602361446E-4},1.1449294805041029E-3,1.9540989965284561E-3,2.8416096073977343E-3,3.8181120831347532E-3,4.9041202185507102E-3,6.1353585648452726E-3,7.5788057657613381E-3,1.0641770390435536E-2,1.0042906556686168E-2,9.4413224161948184E-3,8.839738275703465E-3,8.2381541352121133E-3,7.6365699947207625E-3,7.03498585422941E-3,6.4334017137380574E-3,5.8318175732467083E-3,5.2302334327553558E-3,5.2639355812229838E-4,5.2639355812229838E-4]
[2,0,3.8948186284183689E-4,1.0715734142900282E-3,1.823484901140151E-3,2.6419981520867056E-3,3.5335837727347203E-3,4.511421124174189E-3,5.5974240502982085E-3,6.8286562175020969E-3,9.1798803385871718E-3,8.5974198591650345E-3,8.013113930506563E-3,7.4288080018480931E-3,6.8445020731896242E-3,6.2601961445311518E-3,5.6758902158726837E-3,5.0915842872142139E-3,4.5072783585557424E-3,3.9229724298972726E-3,-6.4576757040152657E-4,-6.4576757040152657E-4]
[3,0,3.6474252535954844E-4,1.0013088037909303E-3,1.6994110572245739E-3,2.4543748099909836E-3,3.2698072887086208E-3,4.1541302757835026E-3,5.1210841141404312E-3,6.1923853068794202E-3,8.1278880873593817E-3,7.5631965860207774E-3,6.9970636121452464E-3,6.4309306382697162E-3,5.8647976643941852E-3,5.2986646905186559E-3,4.7325317166431249E-3,4.1663987427675948E-3,3.6002657688920638E-3,3.0341327950165337E-3,-1.3925112562798939E-3,-1.3925112562798922E-3]
[4,0,3.4080237227763479E-4,9.337165540301473E-4,1.5809284183540369E-3,2.2768289528152666E-3,3.0230528206819799E-3,3.824864731477742E-3,4.6909474718798581E-3,5.6344583883246894E-3,7.2807012222360105E-3,6.7348977570415684E-3,6.187903828936003E-3,5.6409099008304358E-3,5.0939159727248686E-3,4.5469220446193032E-3,3.999928116513736E-3,3.452934188408171E-3,2.9059402603026033E-3,2.3589463321970353E-3,-1.9180478187851083E-3,-1.9180478187851117E-3]
[5,0,3.1755552889560658E-4,8.6843271198784534E-4,1.4672348467422965E-3,2.1078005391599796E-3,2.7904086403776891E-3,3.5181978099662501E-3,4.2966211717657306E-3,5.1337829316565435E-3,6.5596871117753024E-3,6.0338892479916105E-3,5.5070795976759181E-3,4.9802699473602248E-3,4.4534602970445324E-3,3.92665064672884E-3,3.3998409964131446E-3,2.8730313460974522E-3,2.3462216957817594E-3,1.8194120454660644E-3,-2.2997594431182142E-3,-2.2997594431182142E-3]
[6,0,2.9490704789649061E-4,8.0513742512505532E-4,1.3576427979352865E-3,1.945993008027244E-3,2.5695464466481744E-3,3.2299997296835123E-3,3.9306987735245168E-3,4.6766435501558196E-3,5.9248764614656113E-3,5.4202584295110524E-3,4.9147663168914923E-3,4.4092742042719322E-3,3.9037820916523716E-3,3.3982899790328115E-3,2.8927978664132514E-3,2.3873057537936913E-3,1.8818136411741342E-3,1.376321528554574E-3,-2.5761662376793072E-3,-2.5761662376793072E-3]
[7,0,2.8002413980975549E-4,7.6369919615797426E-4,1.2862101448404503E-3,1.8410693928167174E-3,2.4271992325204084E-3,3.0456001289469619E-3,3.6986234643564962E-3,4.3898619566105314E-3,5.5356532667219308E-3,5.0459232167784102E-3,4.5553962889296404E-3,4.0648693610808705E-3,3.5743424332321042E-3,3.0838155053833347E-3,2.5932885775345653E-3,2.1027616496857963E-3,1.6122347218370265E-3,1.1217077939882593E-3,-2.7137658621352668E-3,-2.7137658621352668E-3]
[""]
[""]
["d (t)"]
[null,null,"Stage I",null,null,null,null,null,null,null,null,"Stage II"]
[null,"start value","Dx1","Dx2","Dx3","Dx4","Dx5","Dx6","Dx7","Dx8","Dx9","Dx10","Dx11","Dx12","Dx13","Dx14","Dx15","Dx16","Dx17","Dx18","Dx19","Dx20","SDx"]
["Distance from X=0",null,{"$f":"($B$32+$C$32)/2","v":18},{"$f":"($C$32+$D$32)/2","v":44.5},{"$f":"($D$32+$E$32)/2","v":58},{"$f":"($E$32+$F$32)/2","v":66.5},{"$f":"($F$32+$G$32)/2","v":72.5},{"$f":"($G$32+$H$32)/2","v":77.5},{"$f":"($H$32+$I$32)/2","v":82},{"$f":"($I$32+$J$32)/2","v":85.5},{"$f":"($J$32+$K$32)/2","v":90},{"$f":"($K$32+$L$32)/2","v":94.5},{"$f":"($L$32+$M$32)/2","v":97.5},{"$f":"($M$32+$N$32)/2","v":100},{"$f":"(N14+O14)/2","v":0},{"$f":"($O$32+$P$32)/2","v":104},{"$f":"($P$32+$Q$32)/2","v":106.5},{"$f":"($Q$32+$R$32)/2","v":109},{"$f":"($R$32+$S$32)/2","v":111},{"$f":"($S$32+$T$32)/2","v":113},{"$f":"($T$32+$U$32)/2","v":114}]
["Z från slip surface"]
[0,0,{"$f":"OFFSET($K39,0,(COLUMN(B$1)-COLUMN($B$1))*5)","v":0},0,0,0,0,0,0,0,0,0,0,0,0,0,0,0,0,0,0,0]
[{"$f":"IF(A126<Height/3,A126+1,\"\")","v":1},0,4.2849589766606711E-4,1.1833974487000377E-3,2.023245897351986E-3,2.9486023821812734E-3,3.9732086252492289E-3,5.123418054863476E-3,6.4473871238259831E-3,8.0453346703204479E-3,1.2600137454049403E-2,1.2071725835964235E-2,1.1461917715425155E-2,1.0852109594886075E-2,1.0242301474346995E-2,9.6324933538079142E-3,9.0226852332688338E-3,8.4128771127297535E-3,7.803068992190674E-3,7.1932608716515946E-3,2.425116965923073E-3,2.425116965923073E-3]
[2,0,4.0231079443272567E-4,1.1082514473970656E-3,1.8887919488343036E-3,2.7418038797422202E-3,3.6758479279347367E-3,4.70777067136245E-3,5.866391307571741E-3,7.2037309916317179E-3,9.9108253645113532E-3,9.3201632079256014E-3,8.7272181733506898E-3,8.13427313877578E-3,7.5413281042008683E-3,6.9483830696259567E-3,6.3554380350510468E-3,5.7624930004761352E-3,5.1695479659012254E-3,4.5766029313263137E-3,-5.9687006139614099E-5,-5.9687006139614099E-5]
[3,0,3.7711219410069264E-4,1.0364411090404793E-3,1.7614479791823625E-3,2.5481864810388446E-3,3.4016955307216703E-3,4.3327756999788462E-3,5.3592540822193198E-3,6.510520762190759E-3,8.6538842129732767E-3,8.0803082225929055E-3,7.5050887713259042E-3,6.9298693200589047E-3,6.3546498687919051E-3,5.7794304175249039E-3,5.2042109662579043E-3,4.6289915149909048E-3,4.0537720637239035E-3,3.4785526124569031E-3,-1.0191394133407103E-3,-1.0191394133407094E-3]
[4,0,3.5277244881859162E-4,9.6751267891053881E-4,1.6401697377893053E-3,2.3656018814031251E-3,3.1464300546953003E-3,3.9894975036306223E-3,4.9060157930101451E-3,5.9134218476020548E-3,7.7042946547976957E-3,7.1490471715311733E-3,6.5924837205406251E-3,6.035920269550076E-3,5.4793568185595269E-3,4.9227933675689796E-3,4.3662299165784305E-3,3.8096664655878831E-3,3.2531030145973336E-3,2.6965395636067845E-3,-1.6552795375325011E-3,-1.655279537532502E-3]
[5,0,3.2917895058662066E-4,9.0107463300899632E-4,1.5240816325481667E-3,2.1923147459876231E-3,2.9067307305298343E-3,3.671531270721996E-3,4.4937843218227948E-3,5.3841206599906169E-3,6.9201941670056569E-3,6.3843935025165895E-3,5.847491713305961E-3,5.3105899240953307E-3,4.7736881348847005E-3,4.236786345674072E-3,3.6998845564634401E-3,3.1629827672528116E-3,2.6260809780421814E-3,2.0891791888315498E-3,-2.1089036309516612E-3,-2.108903630951663E-3]
[6,0,3.0623128839604859E-4,8.3678506855645028E-4,1.4124388223387915E-3,2.0268967735936117E-3,2.6799775435129318E-3,3.3740987698248812E-3,4.1136599726451237E-3,4.9052132409061816E-3,6.2422817866204568E-3,5.7270738387513315E-3,5.2109229572837052E-3,4.6947720758160789E-3,4.1786211943484518E-3,3.6624703128808256E-3,3.146319431413198E-3,2.6301685499455717E-3,2.1140176684779468E-3,1.5978667870103192E-3,-2.4379628403987607E-3,-2.4379628403987607E-3]
[7,0,1.926019478815924E-4,5.2556026812981479E-4,8.8569073582987171E-4,1.2686659042827268E-3,1.6739098025214752E-3,2.1023259526412085E-3,2.5558229496901392E-3,3.0372793447667268E-3,3.8392774589428263E-3,3.5061708515069698E-3,3.1725044729500793E-3,2.8388380943931888E-3,2.5051717158362991E-3,2.1715053372794086E-3,1.8378389587225185E-3,1.5041725801656282E-3,1.1705062016087388E-3,8.3683982305184903E-4,-1.7721272534378821E-3,-1.7721272534378821E-3]
[]
[]
["Summary"]
[null,null,"Stage I",null,null,null,null,null,null,null,null,"Stage II"]
[null,"start value","Dx1","Dx2","Dx3","Dx4","Dx5","Dx6","Dx7","Dx8","Dx9","Dx10","Dx11","Dx12","Dx13","Dx14","Dx15","Dx16","Dx17","Dx18","Dx19","Dx20"]
["Distance from foot of slope where x=0",null,{"$f":"B32&\" (\"&ROUND($V$30,0)&\")\"","v":"0 (152)"},"36 (152)","53 (152)","63 (152)","70 (152)","75 (152)","80 (152)","84 (152)","87 (152)","93 (152)","96 (152)","99 (152)","101 (152)","103 (152)","105 (152)","108 (152)","110 (152)","112 (152)","114 (152)","114 (152)"]
[null,0,{"$f":"($B$32+$C$32)/2","v":18},{"$f":"($C$32+$D$32)/2","v":44.5},{"$f":"($D$32+$E$32)/2","v":58},{"$f":"($E$32+$F$32)/2","v":66.5},{"$f":"($F$32+$G$32)/2","v":72.5},{"$f":"($G$32+$H$32)/2","v":77.5},{"$f":"($H$32+$I$32)/2","v":82},{"$f":"($I$32+$J$32)/2","v":85.5},{"$f":"($J$32+$K$32)/2","v":90},{"$f":"($K$32+$L$32)/2","v":94.5},{"$f":"($L$32+$M$32)/2","v":97.5},{"$f":"($M$32+$N$32)/2","v":100},{"$f":"($N$32+$O$32)/2","v":102},{"$f":"($O$32+$P$32)/2","v":104},{"$f":"($P$32+$Q$32)/2","v":106.5},{"$f":"($Q$32+$R$32)/2","v":109},{"$f":"($R$32+$S$32)/2","v":111},{"$f":"($S$32+$T$32)/2","v":113},{"$f":"($T$32+$U$32)/2","v":114},{"$f":"($T$32+V30)/2","v":133.1018345332833}]
["D N",0,{"$f":"OFFSET($J50,0,(COLUMN(B$1)-COLUMN($B$1))*5)","v":9.0964565147526262},15.724546548005129,17.021260885617803,18.141356501178837,19.286193438453218,20.576632358754889,22.135861784956948,24.250648699232567,46.792250799617037,22.373471644984058,17.785926633477835,14.377679256482748,11.544325678641227,9.0775636623688758,6.8530461784306622,4.7904484702559893,2.8368533613918561,0.93913796826323082,-6.7911303194260698E-12,-283.60308317210502,"D N"]
["SD N",0,9.0964565147526262,24.821003062757754,41.84226394837556,59.983620449554394,79.269813888007604,99.846446246762497,121.98230803171944,146.232956730952,193.02520753056905,215.3986791755531,233.18460580903093,247.56228506551366,259.10661074415486,268.18417440652377,275.03722058495441,279.82766905521038,282.66452241660221,283.60366038486546,283.6036603848587,5.77212753682943E-4,"SD N"]
[" d (N)",0,2.3884409681393325E-3,4.1709498551103239E-3,4.5764096626770435E-3,4.9564086178878961E-3,5.3658014896914887E-3,5.8442964528463729E-3,6.4389046506369216E-3,7.2581669601271713E-3,1.4872539737037652E-2,8.2581162146516986E-3,8.171724647448083E-3,8.1685942200414186E-3,8.1693128664100424E-3,8.1707585215194806E-3,8.1704858953970567E-3,8.1673057329709579E-3,8.1717962661034295E-3,8.1702803555963929E-3,7.5685579592171633E-15,7.9017433037620738E-2," d (N)"]
["S d (N)",0,2.3884409681393325E-3,6.559390823249656E-3,1.1135800485926699E-2,1.6092209103814595E-2,2.1458010593506084E-2,2.7302307046352458E-2,3.3741211696989376E-2,4.0999378657116545E-2,5.5871918394154195E-2,6.4130034608805897E-2,7.2301759256253983E-2,8.04703534762954E-2,8.8639666342705439E-2,9.681042486422492E-2,0.10498091075962197,0.11314821649259293,0.12132001275869636,0.12949029311429275,0.12949029311430033,0.20850772615192106,"S d (N)"]
["S d (t)",0,2.3887035218823384E-3,6.5590226537433818E-3,1.1135866753874788E-2,1.6092072048229423E-2,2.145780021516518E-2,2.7301417923023479E-2,3.3742315550785246E-2,4.0999621517408505E-2,5.5870895098900669E-2,6.4130133173724874E-2,7.2300128610054248E-2,8.0470124046383651E-2,8.8640119482713026E-2,9.6810114919042414E-2,0.1049801103553718,0.11315010579170118,0.12132010122803057,0.12949009666435993,0.12949029311430033,0.20850772615192106,"S d (t)"]
[{"$f":"IF(A145<Height/3,A145+1,\"\")","v":""}]
[]
[]
["End of Stage I","N",{"$f":"K142","v":193.02520753056905},"kN/m3"]
["End of stageI","x",{"$f":"K32","v":93},"m"]
["Critical Load","Ncrit [kN/m3]",{"$f":"MAX(C142:V142)","v":283.60366038486546},"kN/m3"]
["Critical lenght","Lcrit [m]",{"$f":"T32","v":114},"m"]
[null,"Linstab",{"$f":"U30","v":38.610033302034523},"m"]
[null,"q",{"$f":"C151/Height","v":14.180183019243273},"kN/m2"]
["Critical deformation","dcrit",{"$f":"$T$145","v":0.12949009666435993},"m"]
["Momentarily def","dinstab",{"$f":"$V$145","v":0.20850772615192106},"m"]

{"sheet":"Explanation","index":1,"n_rows":0,"n_cols":0,"rows_kept":0,"cut":false,"hidden":false,"merged":[]}

{"sheet":"Calculation template empty","index":2,"n_rows":156,"n_cols":106,"rows_kept":156,"cut":false,"hidden":true,"merged":[[2,4,2,5],[21,2,22,2],[35,1,35,4],[93,0,93,1]]}
[]
["Shear strength at surface","cs",null,"kN/m2"]
["Peak value for shear strength evaluated in lab","clab",null,"kN/m2","Factor for increasing shear strength peak  ",null,null,"%"]
["Peak value for shear strength","c",{"$f":"C3*(1+G3/100)","v":0},"kN/m2",null,null,null,null,null,null,null,null,null,null," "]
["Residual value for shear strength","cR",null,"kN/m2",{"$f":"IF(cR<=t0,\"Ok\",\"cR too high\")","v":"Ok"}]
["Shear stress at elastic limit","tel",null,"kN/m2",null,null,"t",0,{"$f":"tel","v":0},{"$f":"I6+($AB$6-$I$6)/19","v":0},{"$f":"J6+($AB$6-$I$6)/19","v":0},{"$f":"K6+($AB$6-$I$6)/19","v":0},0,0,0,0,0,0,0,0,0,0,0,0,0,0,0,{"$f":"c_peak","v":0},{"$f":"cR","v":0},{"$f":"AC6","v":0}]
["Deviator strain at elastic limit","gel",{"$f":"g_f*tel/(2*c_peak-tel)","v":{"$error":"#DIV/0!"}},null,null,null,"g",0,{"$f":"gel","v":{"$error":"#DIV/0!"}},{"$f":"g_f-(g_f-gel)*(1-(J6-tel)/(c_peak-tel))^0.5","v":{"$error":"#DIV/0!"}},{"$error":"#DIV/0!"},{"$error":"#DIV/0!"},{"$error":"#DIV/0!"},{"$error":"#DIV/0!"},{"$error":"#DIV/0!"},{"$error":"#DIV/0!"},{"$error":"#DIV/0!"},{"$error":"#DIV/0!"},{"$error":"#DIV/0!"},{"$error":"#DIV/0!"},{"$error":"#DIV/0!"},{"$error":"#DIV/0!"},{"$error":"#DIV/0!"},{"$error":"#DIV/0!"},{"$error":"#DIV/0!"},{"$error":"#DIV/0!"},{"$error":"#DIV/0!"},{"$f":"g_f","v":0},{"$f":"def_cR","v":0},{"$f":"def_cR+0.05","v":0.05}]
["Deviator strain at failure limit","gf",null,null,null,null,"t0",{"$f":"t0","v":0},0,0,0,0,0,0,0,0,0,0,0,0,0,0,0,0,0,0,0,0,0,0]
["Elastic modulus at shear","G",{"$f":"tel/gel","v":{"$error":"#DIV/0!"}},null,null,null,null,null,null,null,null,null,null,null,null,null,null,null,null,null,null,null,null,null,null,null,null,{"$f":"F9","v":0}]
["Elastic modulus","Emean",{"$f":"G/c_peak*2*(1+0.5)*(cS+c_peak)/2","v":{"$error":"#DIV/0!"}}]
["Post peak slip at z=0 when cR is reached","dcR",null,"m"]
["Density:","dstart"]
[null,"dgain"]
["Depth to slip surface","H",null,"m"]
["Gradient","dy/dx"]
["Sensitivity ratio","cR/cu",{"$f":"cR/c_peak","v":{"$error":"#DIV/0!"}}]
[]
["Colour indication:"]
["Cells that require input"]
["to<tel"]
["to>tel"]
["t+Dt<tel",null,"  Stage I"]
["tel<t+Dt<cu"]
["cu<t+Dt<cR",null,"Stage IIa"]
["t+Dt=cR",null,"Stage IIb"]
[null,null,null,null,null,null,null,null,null,null,"c",null,null,null,null,null,null,null,"to","cR"]
[]
[null,"Stage I",null,null,null,null,null,null,null,null,"Stage II"]
[null,"Dx1","Dx2","Dx3","Dx4","Dx5","Dx6","Dx7","Dx8","Dx9","Dx10","Dx11","Dx12","Dx13","Dx14","Dx15","Dx16","Dx17","Dx18","Dx19","Dx20","SDx"]
["length of Dx",36.385826059010505,17.041257051505603,9.5132360995152361,6.7452629987239696,5.3397221812728493,4.5215485620236722,4.0223895573480908,3.7500187400899088,6.0749793369883278,2.8019464525139419,2.5244141873137331,2.3546199179529212,2.2343502861473765,2.147346697921872,2.0843036691296248,2.0397716123174328,2.0132189400091605,1.9994234147459702,1.8491037887086547E-12,38.610033302034523,{"$f":"SUM(Dx)","v":152.20366906656659}]
["Dt",{"$f":"0.5+((COLUMN(A1)-COLUMN($A$1))^grad)*((c_peak-$B$39)/10)","v":{"$error":"#NUM!"}},{"$f":"((COLUMN(B1)-COLUMN($A$1))^grad)*((c_peak-$B$39)/10)","v":0},0,0,0,0,0,0,{"$f":"E39-0.001-AR39","v":{"$error":"#DIV/0!"}},{"$f":"IF(t0>cR,-(c_peak-t0)/9,-(c_peak-cR)/9)","v":0},0,0,0,0,0,0,0,0,{"$f":"cR-CP39","v":0},0]
["Start (length from x=0)",0,{"$f":"ROUND(SUM($B$30:B30),0)","v":36},{"$f":"ROUND(SUM($B$30:C30),0)","v":53},{"$f":"ROUND(SUM($B$30:D30),0)","v":63},{"$f":"ROUND(SUM($B$30:E30),0)","v":70},{"$f":"ROUND(SUM($B$30:F30),0)","v":75},{"$f":"ROUND(SUM($B$30:G30),0)","v":80},{"$f":"ROUND(SUM($B$30:H30),0)","v":84},{"$f":"ROUND(SUM($B$30:I30),0)","v":87},{"$f":"ROUND(SUM($B$30:J30),0)","v":93},{"$f":"ROUND(SUM($B$30:K30),0)","v":96},{"$f":"ROUND(SUM($B$30:L30),0)","v":99},{"$f":"ROUND(SUM($B$30:M30),0)","v":101},{"$f":"ROUND(SUM($B$30:N30),0)","v":103},{"$f":"ROUND(SUM($B$30:O30),0)","v":105},{"$f":"ROUND(SUM($B$30:P30),0)","v":108},{"$f":"ROUND(SUM($B$30:Q30),0)","v":110},{"$f":"ROUND(SUM($B$30:R30),0)","v":112},{"$f":"ROUND(SUM($B$30:S30),0)","v":114},{"$f":"ROUND(SUM($B$30:T30),0)","v":114}]
[]
[]
[null,null,null,null,null,null,"STAGE I",null,null,null,null,null,null,null,null,null,null,null,null,null,null,null,null,null,null,null,null,null,null,null,null,null,null,null,null,null,null,null,null,null,null,null,null,null,null,null,null,null,null,null,null,"STAGE II"]
[null,"In situ",null,null,null,"Stage II",null,"x",1,null,{"$f":"OFFSET($B$30,0,(COLUMN(B1)-COLUMN($B$1))/5)","v":36.385826059010505},null,"x",{"$f":"I36+1","v":2},null,{"$f":"OFFSET($B$30,0,(COLUMN(G1)-COLUMN($B$1))/5)","v":17.041257051505603},null,"x",{"$f":"N36+1","v":3},null,{"$f":"OFFSET($B$30,0,(COLUMN(L1)-COLUMN($B$1))/5)","v":9.5132360995152361},null,"x",{"$f":"S36+1","v":4},null,{"$f":"OFFSET($B$30,0,(COLUMN(Q1)-COLUMN($B$1))/5)","v":6.7452629987239696},null,"x",{"$f":"X36+1","v":5},null,{"$f":"OFFSET($B$30,0,(COLUMN(V1)-COLUMN($B$1))/5)","v":5.3397221812728493},null,"x",{"$f":"AC36+1","v":6},null,{"$f":"OFFSET($B$30,0,(COLUMN(AA1)-COLUMN($B$1))/5)","v":4.5215485620236722},null,"x",{"$f":"AH36+1","v":7},null,{"$f":"OFFSET($B$30,0,(COLUMN(AF1)-COLUMN($B$1))/5)","v":4.0223895573480908},null,"x",{"$f":"AM36+1","v":8},null,{"$f":"OFFSET($B$30,0,(COLUMN(AK1)-COLUMN($B$1))/5)","v":3.7500187400899088},null,"x",{"$f":"AR36+1","v":9},null,{"$f":"OFFSET($B$30,0,(COLUMN(AP1)-COLUMN($B$1))/5)","v":6.0749793369883278},null,"x",{"$f":"AW36+1","v":10},null,{"$f":"OFFSET($B$30,0,(COLUMN(AU1)-COLUMN($B$1))/5)","v":2.8019464525139419},null,"x",{"$f":"BB36+1","v":11},null,{"$f":"OFFSET($B$30,0,(COLUMN(AZ1)-COLUMN($B$1))/5)","v":2.5244141873137331},null,"x",{"$f":"BG36+1","v":12},null,{"$f":"OFFSET($B$30,0,(COLUMN(BE1)-COLUMN($B$1))/5)","v":2.3546199179529212},null,"x",{"$f":"BL36+1","v":13},null,{"$f":"OFFSET($B$30,0,(COLUMN(BJ1)-COLUMN($B$1))/5)","v":2.2343502861473765},null,"x",{"$f":"BQ36+1","v":14},null,{"$f":"OFFSET($B$30,0,(COLUMN(BO1)-COLUMN($B$1))/5)","v":2.147346697921872},null,"x",{"$f":"BV36+1","v":15},null,{"$f":"OFFSET($B$30,0,(COLUMN(BT1)-COLUMN($B$1))/5)","v":2.0843036691296248},null,"x",{"$f":"CA36+1","v":16},null,{"$f":"OFFSET($B$30,0,(COLUMN(BY1)-COLUMN($B$1))/5)","v":2.0397716123174328},null,"x",{"$f":"CF36+1","v":17},null,{"$f":"OFFSET($B$30,0,(COLUMN(CD1)-COLUMN($B$1))/5)","v":2.0132189400091605},null,"x",{"$f":"CK36+1","v":18},null,{"$f":"OFFSET($B$30,0,(COLUMN(CI1)-COLUMN($B$1))/5)","v":1.9994234147459702},null,"x",{"$f":"CP36+1","v":19},null,{"$f":"OFFSET($B$30,0,(COLUMN(CN1)-COLUMN($B$1))/5)","v":1.8491037887086547E-12},null,"x",{"$f":"CU36+1","v":20},null,{"$f":"OFFSET($B$30,0,(COLUMN(CS1)-COLUMN($B$1))/5)","v":38.610033302034523}]
["start of Dx(Sx)",null,null,null,null,null,null,null,null,null,{"$f":"OFFSET($B$32,0,(COLUMN(B1)-COLUMN($B$1))*5)&\" (\"&ROUND($V$30,0)&\")\"","v":"0 (152)"},null,null,null,null,{"$f":"OFFSET($B$32,0,(COLUMN(G1)-COLUMN($B$1))/5)&\" (\"&ROUND($V$30,0)&\")\"","v":"36 (152)"},null,null,null,null,{"$f":"OFFSET($B$32,0,(COLUMN(L1)-COLUMN($B$1))/5)&\" (\"&ROUND($V$30,0)&\")\"","v":"53 (152)"},null,null,null,null,{"$f":"OFFSET($B$32,0,(COLUMN(Q1)-COLUMN($B$1))/5)&\" (\"&ROUND($V$30,0)&\")\"","v":"63 (152)"},null,null,null,null,{"$f":"OFFSET($B$32,0,(COLUMN(V1)-COLUMN($B$1))/5)&\" (\"&ROUND($V$30,0)&\")\"","v":"70 (152)"},null,null,null,null,{"$f":"OFFSET($B$32,0,(COLUMN(AA1)-COLUMN($B$1))/5)&\" (\"&ROUND($V$30,0)&\")\"","v":"75 (152)"},null,null,null,null,{"$f":"OFFSET($B$32,0,(COLUMN(AF1)-COLUMN($B$1))/5)&\" (\"&ROUND($V$30,0)&\")\"","v":"80 (152)"},null,null,null,null,{"$f":"OFFSET($B$32,0,(COLUMN(AK1)-COLUMN($B$1))/5)&\" (\"&ROUND($V$30,0)&\")\"","v":"84 (152)"},null,null,null,null,{"$f":"OFFSET($B$32,0,(COLUMN(AP1)-COLUMN($B$1))/5)&\" (\"&ROUND($V$30,0)&\")\"","v":"87 (152)"},null,null,null,null,{"$f":"OFFSET($B$32,0,(COLUMN(AU1)-COLUMN($B$1))/5)&\" (\"&ROUND($V$30,0)&\")\"","v":"93 (152)"},null,null,null,null,{"$f":"OFFSET($B$32,0,(COLUMN(AZ1)-COLUMN($B$1))/5)&\" (\"&ROUND($V$30,0)&\")\"","v":"96 (152)"},null,null,null,null,{"$f":"OFFSET($B$32,0,(COLUMN(BE1)-COLUMN($B$1))/5)&\" (\"&ROUND($V$30,0)&\")\"","v":"99 (152)"},null,null,null,null,{"$f":"OFFSET($B$32,0,(COLUMN(BJ1)-COLUMN($B$1))/5)&\" (\"&ROUND($V$30,0)&\")\"","v":"101 (152)"},null,null,null,null,{"$f":"OFFSET($B$32,0,(COLUMN(BO1)-COLUMN($B$1))/5)&\" (\"&ROUND($V$30,0)&\")\"","v":"103 (152)"},null,null,null,null,{"$f":"OFFSET($B$32,0,(COLUMN(BT1)-COLUMN($B$1))/5)&\" (\"&ROUND($V$30,0)&\")\"","v":"105 (152)"},null,null,null,null,{"$f":"OFFSET($B$32,0,(COLUMN(BY1)-COLUMN($B$1))/5)&\" (\"&ROUND($V$30,0)&\")\"","v":"108 (152)"},null,null,null,null,{"$f":"OFFSET($B$32,0,(COLUMN(CD1)-COLUMN($B$1))/5)&\" (\"&ROUND($V$30,0)&\")\"","v":"110 (152)"},null,null,null,null,{"$f":"OFFSET($B$32,0,(COLUMN(CI1)-COLUMN($B$1))/5)&\" (\"&ROUND($V$30,0)&\")\"","v":"112 (152)"},null,null,null,null,{"$f":"OFFSET($B$32,0,(COLUMN(CN1)-COLUMN($B$1))/5)&\" (\"&ROUND($V$30,0)&\")\"","v":"114 (152)"},null,null,null,null,{"$f":"OFFSET($B$32,0,(COLUMN(CS1)-COLUMN($B$1))/5)&\" (\"&ROUND($V$30,0)&\")\"","v":"114 (152)"}]
["Z från slip surface","to","Density","tel","cu","tmax","t","Dt","t+Dt","g(t)","d (t)","t","Dt","t+Dt","g(t)","d (t)","t","Dt","t+Dt","g(t)","d (t)","t","Dt","t+Dt","g(t)","d (t)","t","Dt","t+Dt","g(t)","d (t)","t","Dt","t+Dt","g(t)","d (t)","t","Dt","t+Dt","g(t)","d (t)","t","Dt","t+Dt","g(t)","d (t)","t","Dt","t+Dt","g(t)","d (t)","t","Dt","t+Dt","g(t)","d (t)","t","Dt","t+Dt","g(t)","d (t)","t","Dt","t+Dt","g(t)","d (t)","t","Dt","t+Dt","g(t)","d (t)","t","Dt","t+Dt","g(t)","d (t)","t","Dt","t+Dt","g(t)","d (t)","t","Dt","t+Dt","g(t)","d (t)","t","Dt","t+Dt","g(t)","d (t)","t","Dt","t+Dt","g(t)","d (t)","t","Dt","t+Dt","g(t)","d (t)","t","Dt","t+Dt","g(t)","d (t)"]
[0,{"$f":"Density*Height*SIN(ATAN(grad))","v":0},{"$f":"$C$12+$C$13*(Height-z)","v":0},{"$f":"tel*cu/c_peak","v":{"$error":"#DIV/0!"}},{"$f":"c_peak-(c_peak-cS)*z/Height","v":{"$error":"#DIV/0!"}},{"$f":"c_peak","v":0},{"$f":"to","v":0},{"$f":"B31","v":{"$error":"#NUM!"}},{"$f":"t+dt_z","v":{"$error":"#NUM!"}},{"$f":"IF(I39<t_el,(I39-t)*gel/t_el,(IF(to>t_el,(g_f-gel)*(SQRT(1-(to-t_el)/(cu-t_el))-SQRT(1-(I39-t_el)/(cu-t_el))),(t_el-to)*gel/t_el+(g_f-gel)*(1-SQRT(ABS(1-(I39-t_el)/(cu-t_el)))))))","v":{"$error":"#NUM!"}},0,{"$f":"t_Dt","v":{"$error":"#NUM!"}},{"$f":"C31","v":0},{"$f":"L39+M39","v":{"$error":"#NUM!"}},{"$f":"IF(N39<t_el,(N39-t)*gel/t_el,(IF(to>t_el,(g_f-gel)*(SQRT(1-(to-t_el)/(cu-t_el))-SQRT(1-(N39-t_el)/(cu-t_el))),(t_el-to)*gel/t_el+(g_f-gel)*(1-SQRT(ABS(1-(N39-t_el)/(cu-t_el)))))))","v":{"$error":"#NUM!"}},0,{"$f":"N39","v":{"$error":"#NUM!"}},{"$f":"D31","v":0},{"$f":"Q39+R39","v":{"$error":"#NUM!"}},{"$f":"IF(S39<t_el,(S39-t)*gel/t_el,(IF(to>t_el,(g_f-gel)*(SQRT(1-(to-t_el)/(cu-t_el))-SQRT(1-(S39-t_el)/(cu-t_el))),(t_el-to)*gel/t_el+(g_f-gel)*(1-SQRT(ABS(1-(S39-t_el)/(cu-t_el)))))))","v":{"$error":"#NUM!"}},0,{"$f":"S39","v":{"$error":"#NUM!"}},{"$f":"E31","v":0},{"$f":"V39+W39","v":{"$error":"#NUM!"}},{"$f":"IF(X39<t_el,(X39-t)*gel/t_el,(IF(to>t_el,(g_f-gel)*(SQRT(1-(to-t_el)/(cu-t_el))-SQRT(1-(X39-t_el)/(cu-t_el))),(t_el-to)*gel/t_el+(g_f-gel)*(1-SQRT(ABS(1-(X39-t_el)/(cu-t_el)))))))","v":{"$error":"#NUM!"}},0,{"$f":"X39","v":{"$error":"#NUM!"}},{"$f":"F31","v":0},{"$f":"AA39+AB39","v":{"$error":"#NUM!"}},{"$f":"IF(AC39<t_el,(AC39-t)*gel/t_el,(IF(to>t_el,(g_f-gel)*(SQRT(1-(to-t_el)/(cu-t_el))-SQRT(1-(AC39-t_el)/(cu-t_el))),(t_el-to)*gel/t_el+(g_f-gel)*(1-SQRT(ABS(1-(AC39-t_el)/(cu-t_el)))))))","v":{"$error":"#NUM!"}},0,{"$f":"AC39","v":{"$error":"#NUM!"}},{"$f":"G31","v":0},{"$f":"AF39+AG39","v":{"$error":"#NUM!"}},{"$f":"IF(AH39<t_el,(AH39-t)*gel/t_el,(IF(to>t_el,(g_f-gel)*(SQRT(1-(to-t_el)/(cu-t_el))-SQRT(1-(AH39-t_el)/(cu-t_el))),(t_el-to)*gel/t_el+(g_f-gel)*(1-SQRT(ABS(1-(AH39-t_el)/(cu-t_el)))))))","v":{"$error":"#NUM!"}},0,{"$f":"AH39","v":{"$error":"#NUM!"}},{"$f":"H31","v":0},{"$f":"AK39+AL39","v":{"$error":"#NUM!"}},{"$f":"IF(AM39<t_el,(AM39-t)*gel/t_el,(IF(to>t_el,(g_f-gel)*(SQRT(1-(to-t_el)/(cu-t_el))-SQRT(1-(AM39-t_el)/(cu-t_el))),(t_el-to)*gel/t_el+(g_f-gel)*(1-SQRT(ABS(1-(AM39-t_el)/(cu-t_el)))))))","v":{"$error":"#NUM!"}},0,{"$f":"AM39","v":{"$error":"#NUM!"}},{"$f":"I31","v":0},{"$f":"AP39+AQ39","v":{"$error":"#NUM!"}},{"$f":"IF(AR39<t_el,(AR39-t)*gel/t_el,(IF(to>t_el,(g_f-gel)*(SQRT(1-(to-t_el)/(cu-t_el))-SQRT(1-(AR39-t_el)/(cu-t_el))),(t_el-to)*gel/t_el+(g_f-gel)*(1-SQRT(ABS(1-(AR39-t_el)/(cu-t_el)))))))","v":{"$error":"#NUM!"}},0,{"$f":"AR39","v":{"$error":"#NUM!"}},{"$f":"J31","v":{"$error":"#DIV/0!"}},{"$f":"AU39+AV39","v":{"$error":"#NUM!"}},{"$f":"IF(AW39<t_el,(AW39-t)*gel/t_el,(IF(to>t_el,(g_f-gel)*(SQRT(1-(to-t_el)/(cu-t_el))-SQRT(1-(AW39-t_el)/(cu-t_el))),(t_el-to)*gel/t_el+(g_f-gel)*(1-SQRT(ABS(1-(AW39-t_el)/(cu-t_el)))))))","v":{"$error":"#NUM!"}},0,{"$f":"c_peak","v":0},{"$f":"K31","v":0},{"$f":"AZ39+BA39","v":0},{"$f":"IF(to>t_el,(g_f-gel)*(SQRT(1-(to-t_el)/(cu-t_el))-SQRT(1-(ABS(tmax-t_el))/(cu-t_el)))-(tmax-BB39)*gel/t_el,(t_el-to)*gel/t_el+(g_f-gel)*(1-SQRT(1-(ABS(tmax-t_el))/(cu-t_el)))+(BB39-tmax)*gel/t_el)","v":{"$error":"#DIV/0!"}},0,{"$f":"BB39","v":0},{"$f":"L31","v":0},{"$f":"BE39+BF39","v":0},{"$f":"IF(to>t_el,(g_f-gel)*(SQRT(1-(to-t_el)/(cu-t_el))-SQRT(1-(ABS(tmax-t_el))/(cu-t_el)))-(tmax-BG39)*gel/t_el,(t_el-to)*gel/t_el+(g_f-gel)*(1-SQRT(1-(ABS(tmax-t_el))/(cu-t_el)))+(BG39-tmax)*gel/t_el)","v":{"$error":"#DIV/0!"}},0,{"$f":"BG39","v":0},{"$f":"M31","v":0},{"$f":"BJ39+BK39","v":0},{"$f":"IF(to>t_el,(g_f-gel)*(SQRT(1-(to-t_el)/(cu-t_el))-SQRT(1-(ABS(tmax-t_el))/(cu-t_el)))-(tmax-BL39)*gel/t_el,(t_el-to)*gel/t_el+(g_f-gel)*(1-SQRT(1-(ABS(tmax-t_el))/(cu-t_el)))+(BL39-tmax)*gel/t_el)","v":{"$error":"#DIV/0!"}},0,{"$f":"BL39","v":0},{"$f":"N31","v":0},{"$f":"BO39+BP39","v":0},{"$f":"IF(to>t_el,(g_f-gel)*(SQRT(1-(to-t_el)/(cu-t_el))-SQRT(1-(ABS(tmax-t_el))/(cu-t_el)))-(tmax-BQ39)*gel/t_el,(t_el-to)*gel/t_el+(g_f-gel)*(1-SQRT(1-(ABS(tmax-t_el))/(cu-t_el)))+(BQ39-tmax)*gel/t_el)","v":{"$error":"#DIV/0!"}},0,{"$f":"BQ39","v":0},{"$f":"O31","v":0},{"$f":"BT39+BU39","v":0},{"$f":"IF(to>t_el,(g_f-gel)*(SQRT(1-(ABS(to-t_el))/(cu-t_el))-SQRT(1-(ABS(tmax-t_el))/(cu-t_el)))-(tmax-BV39)*gel/t_el,(t_el-to)*gel/t_el+(g_f-gel)*(1-SQRT(1-(ABS(tmax-t_el))/(cu-t_el)))+(BV39-tmax)*gel/t_el)","v":{"$error":"#DIV/0!"}},0,{"$f":"BV39","v":0},{"$f":"P31","v":0},{"$f":"BY39+BZ39","v":0},{"$f":"IF(to>t_el,(g_f-gel)*(SQRT(1-(ABS(to-t_el))/(cu-t_el))-SQRT(1-(ABS(tmax-t_el))/(cu-t_el)))-(tmax-CA39)*gel/t_el,(t_el-to)*gel/t_el+(g_f-gel)*(1-SQRT(1-(ABS(tmax-t_el))/(cu-t_el)))+(CA39-tmax)*gel/t_el)","v":{"$error":"#DIV/0!"}},0,{"$f":"CA39","v":0},{"$f":"Q31","v":0},{"$f":"CD39+CE39","v":0},{"$f":"IF(to>t_el,(g_f-gel)*(SQRT(1-(ABS(to-t_el))/(cu-t_el))-SQRT(1-(ABS(tmax-t_el))/(cu-t_el)))-(tmax-CF39)*gel/t_el,(t_el-to)*gel/t_el+(g_f-gel)*(1-SQRT(1-(ABS(tmax-t_el))/(cu-t_el)))+(CF39-tmax)*gel/t_el)","v":{"$error":"#DIV/0!"}},0,{"$f":"CF39","v":0},{"$f":"R31","v":0},{"$f":"CI39+CJ39","v":0},{"$f":"IF(to>t_el,(g_f-gel)*(SQRT(1-(ABS(to-t_el))/(cu-t_el))-SQRT(1-(ABS(tmax-t_el))/(cu-t_el)))-(tmax-CK39)*gel/t_el,(t_el-to)*gel/t_el+(g_f-gel)*(1-SQRT(1-(ABS(tmax-t_el))/(cu-t_el)))+(CK39-tmax)*gel/t_el)","v":{"$error":"#DIV/0!"}},0,{"$f":"CK39","v":0},{"$f":"S31","v":0},{"$f":"CN39+CO39","v":0},{"$f":"IF(to>t_el,(g_f-gel)*(SQRT(1-(ABS(to-t_el))/(cu-t_el))-SQRT(1-(ABS(tmax-t_el))/(cu-t_el)))-(tmax-CP39)*gel/t_el,(t_el-to)*gel/t_el+(g_f-gel)*(1-SQRT(1-(ABS(tmax-t_el))/(cu-t_el)))+(CP39-tmax)*gel/t_el)","v":{"$error":"#DIV/0!"}},0,{"$f":"CP39","v":0},{"$f":"T31","v":0},{"$f":"CS39+CT39","v":0},{"$f":"IF(to>t_el,(g_f-gel)*(SQRT(1-(ABS(to-t_el))/(cu-t_el))-SQRT(1-(ABS(tmax-t_el))/(cu-t_el)))-(tmax-CU39)*gel/t_el,(t_el-to)*gel/t_el+(g_f-gel)*(1-SQRT(1-(ABS(tmax-t_el))/(cu-t_el)))+(CU39-tmax)*gel/t_el)","v":{"$error":"#DIV/0!"}},0,{"$f":"CU39","v":0},{"$f":"U31","v":0},{"$f":"CX39+CY39","v":0},{"$f":"IF(to>t_el,(g_f-gel)*(SQRT(1-(ABS(to-t_el))/(cu-t_el))-SQRT(1-(ABS(tmax-t_el))/(cu-t_el)))-(tmax-CZ39)*gel/t_el,(t_el-to)*gel/t_el+(g_f-gel)*(1-SQRT(1-(ABS(tmax-t_el))/(cu-t_el)))+(CZ39-tmax)*gel/t_el)","v":{"$error":"#DIV/0!"}},0]
[{"$f":"IF(A39<Height/3,A39+1,\"\")","v":""},{"$f":"$B$39*(1-(z-$A$39)/Height)","v":{"$error":"#VALUE!"}},{"$error":"#VALUE!"},{"$error":"#VALUE!"},{"$error":"#VALUE!"},{"$f":"$F$39*(1-(z-$A$39)/Height)","v":{"$error":"#VALUE!"}},{"$f":"$G$39*(1-(z-$A$39)/Height)","v":{"$error":"#VALUE!"}},{"$f":"$H$39*(1-(z-$A$39)/Height)","v":{"$error":"#NUM!"}},{"$error":"#VALUE!"},{"$error":"#VALUE!"},{"$f":"(z-$A39)*AVERAGE(J39:J40)","v":{"$error":"#VALUE!"}},{"$f":"L$39*(1-(z-$A$39)/Height)","v":{"$error":"#NUM!"}},{"$error":"#VALUE!"},{"$error":"#NUM!"},{"$error":"#NUM!"},{"$f":"(z-$A39)*AVERAGE(O39:O40)","v":{"$error":"#VALUE!"}},{"$f":"Q$39*(1-(z-$A$39)/Height)","v":{"$error":"#NUM!"}},{"$error":"#VALUE!"},{"$f":"Q40+R40","v":{"$error":"#NUM!"}},{"$error":"#NUM!"},{"$f":"(z-$A39)*AVERAGE(T39:T40)","v":{"$error":"#VALUE!"}},{"$f":"V$39*(1-(z-$A$39)/Height)","v":{"$error":"#NUM!"}},{"$error":"#VALUE!"},{"$error":"#NUM!"},{"$error":"#NUM!"},{"$f":"(z-$A39)*AVERAGE(Y39:Y40)","v":{"$error":"#VALUE!"}},{"$f":"AA$39*(1-(z-$A$39)/Height)","v":{"$error":"#NUM!"}},{"$error":"#VALUE!"},{"$f":"AA40+AB40","v":{"$error":"#NUM!"}},{"$error":"#NUM!"},{"$f":"(z-$A39)*AVERAGE(AD39:AD40)","v":{"$error":"#VALUE!"}},{"$f":"AF$39*(1-(z-$A$39)/Height)","v":{"$error":"#NUM!"}},{"$error":"#VALUE!"},{"$error":"#NUM!"},{"$error":"#NUM!"},{"$f":"(z-$A39)*AVERAGE(AI39:AI40)","v":{"$error":"#VALUE!"}},{"$f":"AK$39*(1-(z-$A$39)/Height)","v":{"$error":"#NUM!"}},{"$error":"#VALUE!"},{"$f":"AK40+AL40","v":{"$error":"#NUM!"}},{"$error":"#NUM!"},{"$f":"(z-$A39)*AVERAGE(AN39:AN40)","v":{"$error":"#VALUE!"}},{"$f":"AP$39*(1-(z-$A$39)/Height)","v":{"$error":"#NUM!"}},{"$error":"#VALUE!"},{"$error":"#NUM!"},{"$error":"#NUM!"},{"$f":"(z-$A39)*AVERAGE(AS39:AS40)","v":{"$error":"#VALUE!"}},{"$f":"AU$39*(1-(z-$A$39)/Height)","v":{"$error":"#NUM!"}},{"$error":"#DIV/0!"},{"$f":"AU40+AV40","v":{"$error":"#NUM!"}},{"$error":"#NUM!"},{"$f":"(z-$A39)*AVERAGE(AX39:AX40)","v":{"$error":"#VALUE!"}},{"$f":"AZ$39*(1-(z-$A$39)/Height)","v":{"$error":"#VALUE!"}},{"$error":"#VALUE!"},{"$f":"AZ40+BA40","v":{"$error":"#VALUE!"}},{"$error":"#VALUE!"},{"$f":"(z-$A39)*AVERAGE(BC39:BC40)","v":{"$error":"#VALUE!"}},{"$f":"BE$39*(1-(z-$A$39)/Height)","v":{"$error":"#VALUE!"}},{"$error":"#VALUE!"},{"$error":"#VALUE!"},{"$error":"#VALUE!"},{"$f":"(z-$A39)*AVERAGE(BH39:BH40)","v":{"$error":"#VALUE!"}},{"$f":"BJ$39*(1-(z-$A$39)/Height)","v":{"$error":"#VALUE!"}},{"$error":"#VALUE!"},{"$f":"BJ40+BK40","v":{"$error":"#VALUE!"}},{"$error":"#VALUE!"},{"$f":"(z-$A39)*AVERAGE(BM39:BM40)","v":{"$error":"#VALUE!"}},{"$f":"BO$39*(1-(z-$A$39)/Height)","v":{"$error":"#VALUE!"}},{"$error":"#VALUE!"},{"$error":"#VALUE!"},{"$error":"#VALUE!"},{"$f":"(z-$A39)*AVERAGE(BR39:BR40)","v":{"$error":"#VALUE!"}},{"$f":"BT$39*(1-(z-$A$39)/Height)","v":{"$error":"#VALUE!"}},{"$error":"#VALUE!"},{"$f":"BT40+BU40","v":{"$error":"#VALUE!"}},{"$error":"#VALUE!"},{"$f":"(z-$A39)*AVERAGE(BW39:BW40)","v":{"$error":"#VALUE!"}},{"$f":"BY$39*(1-(z-$A$39)/Height)","v":{"$error":"#VALUE!"}},{"$error":"#VALUE!"},{"$error":"#VALUE!"},{"$error":"#VALUE!"},{"$f":"(z-$A39)*AVERAGE(CB39:CB40)","v":{"$error":"#VALUE!"}},{"$f":"CD$39*(1-(z-$A$39)/Height)","v":{"$error":"#VALUE!"}},{"$error":"#VALUE!"},{"$f":"CD40+CE40","v":{"$error":"#VALUE!"}},{"$error":"#VALUE!"},{"$f":"(z-$A39)*AVERAGE(CG39:CG40)","v":{"$error":"#VALUE!"}},{"$f":"CI$39*(1-(z-$A$39)/Height)","v":{"$error":"#VALUE!"}},{"$error":"#VALUE!"},{"$error":"#VALUE!"},{"$error":"#VALUE!"},{"$f":"(z-$A39)*AVERAGE(CL39:CL40)","v":{"$error":"#VALUE!"}},{"$f":"CN$39*(1-(z-$A$39)/Height)","v":{"$error":"#VALUE!"}},{"$error":"#VALUE!"},{"$f":"CN40+CO40","v":{"$error":"#VALUE!"}},{"$error":"#VALUE!"},{"$f":"(z-$A39)*AVERAGE(CQ39:CQ40)","v":{"$error":"#VALUE!"}},{"$f":"CS$39*(1-(z-$A$39)/Height)","v":{"$error":"#VALUE!"}},{"$error":"#VALUE!"},{"$f":"CS40+CT40","v":{"$error":"#VALUE!"}},{"$error":"#VALUE!"},{"$f":"(z-$A39)*AVERAGE(CV39:CV40)","v":{"$error":"#VALUE!"}},{"$f":"CX$39*(1-(z-$A$39)/Height)","v":{"$error":"#VALUE!"}},{"$error":"#VALUE!"},{"$f":"CX40+CY40","v":{"$error":"#VALUE!"}},{"$error":"#VALUE!"},{"$f":"(z-$A39)*AVERAGE(DA39:DA40)","v":{"$error":"#VALUE!"}}]
["",{"$error":"#VALUE!"},{"$error":"#VALUE!"},{"$error":"#VALUE!"},{"$error":"#VALUE!"},{"$error":"#VALUE!"},{"$error":"#VALUE!"},{"$error":"#NUM!"},{"$error":"#VALUE!"},{"$error":"#VALUE!"},{"$error":"#VALUE!"},{"$error":"#NUM!"},{"$error":"#VALUE!"},{"$error":"#NUM!"},{"$error":"#NUM!"},{"$error":"#VALUE!"},{"$error":"#NUM!"},{"$error":"#VALUE!"},{"$error":"#NUM!"},{"$error":"#NUM!"},{"$error":"#VALUE!"},{"$error":"#NUM!"},{"$error":"#VALUE!"},{"$error":"#NUM!"},{"$error":"#NUM!"},{"$error":"#VALUE!"},{"$error":"#NUM!"},{"$error":"#VALUE!"},{"$error":"#NUM!"},{"$error":"#NUM!"},{"$error":"#VALUE!"},{"$error":"#NUM!"},{"$error":"#VALUE!"},{"$error":"#NUM!"},{"$error":"#NUM!"},{"$error":"#VALUE!"},{"$error":"#NUM!"},{"$error":"#VALUE!"},{"$error":"#NUM!"},{"$error":"#NUM!"},{"$error":"#VALUE!"},{"$error":"#NUM!"},{"$error":"#VALUE!"},{"$error":"#NUM!"},{"$error":"#NUM!"},{"$error":"#VALUE!"},{"$error":"#NUM!"},{"$error":"#DIV/0!"},{"$error":"#NUM!"},{"$error":"#NUM!"},{"$error":"#VALUE!"},{"$error":"#VALUE!"},{"$error":"#VALUE!"},{"$error":"#VALUE!"},{"$error":"#VALUE!"},{"$error":"#VALUE!"},{"$error":"#VALUE!"},{"$error":"#VALUE!"},{"$error":"#VALUE!"},{"$error":"#VALUE!"},{"$error":"#VALUE!"},{"$error":"#VALUE!"},{"$error":"#VALUE!"},{"$error":"#VALUE!"},{"$error":"#VALUE!"},{"$error":"#VALUE!"},{"$error":"#VALUE!"},{"$error":"#VALUE!"},{"$error":"#VALUE!"},{"$error":"#VALUE!"},{"$error":"#VALUE!"},{"$error":"#VALUE!"},{"$error":"#VALUE!"},{"$error":"#VALUE!"},{"$error":"#VALUE!"},{"$error":"#VALUE!"},{"$error":"#VALUE!"},{"$error":"#VALUE!"},{"$error":"#VALUE!"},{"$error":"#VALUE!"},{"$error":"#VALUE!"},{"$error":"#VALUE!"},{"$error":"#VALUE!"},{"$error":"#VALUE!"},{"$error":"#VALUE!"},{"$error":"#VALUE!"},{"$error":"#VALUE!"},{"$error":"#VALUE!"},{"$error":"#VALUE!"},{"$error":"#VALUE!"},{"$error":"#VALUE!"},{"$error":"#VALUE!"},{"$error":"#VALUE!"},{"$error":"#VALUE!"},{"$error":"#VALUE!"},{"$error":"#VALUE!"},{"$error":"#VALUE!"},{"$error":"#VALUE!"},{"$error":"#VALUE!"},{"$error":"#VALUE!"},{"$error":"#VALUE!"},{"$error":"#VALUE!"},{"$error":"#VALUE!"},{"$error":"#VALUE!"},{"$error":"#VALUE!"},{"$error":"#VALUE!"}]
["",{"$error":"#VALUE!"},{"$error":"#VALUE!"},{"$error":"#VALUE!"},{"$error":"#VALUE!"},{"$error":"#VALUE!"},{"$error":"#VALUE!"},{"$error":"#NUM!"},{"$error":"#VALUE!"},{"$error":"#VALUE!"},{"$error":"#VALUE!"},{"$error":"#NUM!"},{"$error":"#VALUE!"},{"$error":"#NUM!"},{"$error":"#NUM!"},{"$error":"#VALUE!"},{"$error":"#NUM!"},{"$error":"#VALUE!"},{"$error":"#NUM!"},{"$error":"#NUM!"},{"$error":"#VALUE!"},{"$error":"#NUM!"},{"$error":"#VALUE!"},{"$error":"#NUM!"},{"$error":"#NUM!"},{"$error":"#VALUE!"},{"$error":"#NUM!"},{"$error":"#VALUE!"},{"$error":"#NUM!"},{"$error":"#NUM!"},{"$error":"#VALUE!"},{"$error":"#NUM!"},{"$error":"#VALUE!"},{"$error":"#NUM!"},{"$error":"#NUM!"},{"$error":"#VALUE!"},{"$error":"#NUM!"},{"$error":"#VALUE!"},{"$error":"#NUM!"},{"$error":"#NUM!"},{"$error":"#VALUE!"},{"$error":"#NUM!"},{"$error":"#VALUE!"},{"$error":"#NUM!"},{"$error":"#NUM!"},{"$error":"#VALUE!"},{"$error":"#NUM!"},{"$error":"#DIV/0!"},{"$error":"#NUM!"},{"$error":"#NUM!"},{"$error":"#VALUE!"},{"$error":"#VALUE!"},{"$error":"#VALUE!"},{"$error":"#VALUE!"},{"$error":"#VALUE!"},{"$error":"#VALUE!"},{"$error":"#VALUE!"},{"$error":"#VALUE!"},{"$error":"#VALUE!"},{"$error":"#VALUE!"},{"$error":"#VALUE!"},{"$error":"#VALUE!"},{"$error":"#VALUE!"},{"$error":"#VALUE!"},{"$error":"#VALUE!"},{"$error":"#VALUE!"},{"$error":"#VALUE!"},{"$error":"#VALUE!"},{"$error":"#VALUE!"},{"$error":"#VALUE!"},{"$error":"#VALUE!"},{"$error":"#VALUE!"},{"$error":"#VALUE!"},{"$error":"#VALUE!"},{"$error":"#VALUE!"},{"$error":"#VALUE!"},{"$error":"#VALUE!"},{"$error":"#VALUE!"},{"$error":"#VALUE!"},{"$error":"#VALUE!"},{"$error":"#VALUE!"},{"$error":"#VALUE!"},{"$error":"#VALUE!"},{"$error":"#VALUE!"},{"$error":"#VALUE!"},{"$error":"#VALUE!"},{"$error":"#VALUE!"},{"$error":"#VALUE!"},{"$error":"#VALUE!"},{"$error":"#VALUE!"},{"$error":"#VALUE!"},{"$error":"#VALUE!"},{"$error":"#VALUE!"},{"$error":"#VALUE!"},{"$error":"#VALUE!"},{"$error":"#VALUE!"},{"$error":"#VALUE!"},{"$error":"#VALUE!"},{"$error":"#VALUE!"},{"$error":"#VALUE!"},{"$error":"#VALUE!"},{"$error":"#VALUE!"},{"$error":"#VALUE!"},{"$error":"#VALUE!"},{"$error":"#VALUE!"},{"$error":"#VALUE!"}]
["",{"$error":"#VALUE!"},{"$error":"#VALUE!"},{"$error":"#VALUE!"},{"$error":"#VALUE!"},{"$error":"#VALUE!"},{"$error":"#VALUE!"},{"$error":"#NUM!"},{"$error":"#VALUE!"},{"$error":"#VALUE!"},{"$error":"#VALUE!"},{"$error":"#NUM!"},{"$error":"#VALUE!"},{"$error":"#NUM!"},{"$error":"#NUM!"},{"$error":"#VALUE!"},{"$error":"#NUM!"},{"$error":"#VALUE!"},{"$error":"#NUM!"},{"$error":"#NUM!"},{"$error":"#VALUE!"},{"$error":"#NUM!"},{"$error":"#VALUE!"},{"$error":"#NUM!"},{"$error":"#NUM!"},{"$error":"#VALUE!"},{"$error":"#NUM!"},{"$error":"#VALUE!"},{"$error":"#NUM!"},{"$error":"#NUM!"},{"$error":"#VALUE!"},{"$error":"#NUM!"},{"$error":"#VALUE!"},{"$error":"#NUM!"},{"$error":"#NUM!"},{"$error":"#VALUE!"},{"$error":"#NUM!"},{"$error":"#VALUE!"},{"$error":"#NUM!"},{"$error":"#NUM!"},{"$error":"#VALUE!"},{"$error":"#NUM!"},{"$error":"#VALUE!"},{"$error":"#NUM!"},{"$error":"#NUM!"},{"$error":"#VALUE!"},{"$error":"#NUM!"},{"$error":"#DIV/0!"},{"$error":"#NUM!"},{"$error":"#NUM!"},{"$error":"#VALUE!"},{"$error":"#VALUE!"},{"$error":"#VALUE!"},{"$error":"#VALUE!"},{"$error":"#VALUE!"},{"$error":"#VALUE!"},{"$error":"#VALUE!"},{"$error":"#VALUE!"},{"$error":"#VALUE!"},{"$error":"#VALUE!"},{"$error":"#VALUE!"},{"$error":"#VALUE!"},{"$error":"#VALUE!"},{"$error":"#VALUE!"},{"$error":"#VALUE!"},{"$error":"#VALUE!"},{"$error":"#VALUE!"},{"$error":"#VALUE!"},{"$error":"#VALUE!"},{"$error":"#VALUE!"},{"$error":"#VALUE!"},{"$error":"#VALUE!"},{"$error":"#VALUE!"},{"$error":"#VALUE!"},{"$error":"#VALUE!"},{"$error":"#VALUE!"},{"$error":"#VALUE!"},{"$error":"#VALUE!"},{"$error":"#VALUE!"},{"$error":"#VALUE!"},{"$error":"#VALUE!"},{"$error":"#VALUE!"},{"$error":"#VALUE!"},{"$error":"#VALUE!"},{"$error":"#VALUE!"},{"$error":"#VALUE!"},{"$error":"#VALUE!"},{"$error":"#VALUE!"},{"$error":"#VALUE!"},{"$error":"#VALUE!"},{"$error":"#VALUE!"},{"$error":"#VALUE!"},{"$error":"#VALUE!"},{"$error":"#VALUE!"},{"$error":"#VALUE!"},{"$error":"#VALUE!"},{"$error":"#VALUE!"},{"$error":"#VALUE!"},{"$error":"#VALUE!"},{"$error":"#VALUE!"},{"$error":"#VALUE!"},{"$error":"#VALUE!"},{"$error":"#VALUE!"},{"$error":"#VALUE!"},{"$error":"#VALUE!"},{"$error":"#VALUE!"}]
["",{"$error":"#VALUE!"},{"$error":"#VALUE!"},{"$error":"#VALUE!"},{"$error":"#VALUE!"},{"$error":"#VALUE!"},{"$error":"#VALUE!"},{"$error":"#NUM!"},{"$error":"#VALUE!"},{"$error":"#VALUE!"},{"$error":"#VALUE!"},{"$error":"#NUM!"},{"$error":"#VALUE!"},{"$error":"#NUM!"},{"$error":"#NUM!"},{"$error":"#VALUE!"},{"$error":"#NUM!"},{"$error":"#VALUE!"},{"$error":"#NUM!"},{"$error":"#NUM!"},{"$error":"#VALUE!"},{"$error":"#NUM!"},{"$error":"#VALUE!"},{"$error":"#NUM!"},{"$error":"#NUM!"},{"$error":"#VALUE!"},{"$error":"#NUM!"},{"$error":"#VALUE!"},{"$error":"#NUM!"},{"$error":"#NUM!"},{"$error":"#VALUE!"},{"$error":"#NUM!"},{"$error":"#VALUE!"},{"$error":"#NUM!"},{"$error":"#NUM!"},{"$error":"#VALUE!"},{"$error":"#NUM!"},{"$error":"#VALUE!"},{"$error":"#NUM!"},{"$error":"#NUM!"},{"$error":"#VALUE!"},{"$error":"#NUM!"},{"$error":"#VALUE!"},{"$error":"#NUM!"},{"$error":"#NUM!"},{"$error":"#VALUE!"},{"$error":"#NUM!"},{"$error":"#DIV/0!"},{"$error":"#NUM!"},{"$error":"#NUM!"},{"$error":"#VALUE!"},{"$error":"#VALUE!"},{"$error":"#VALUE!"},{"$error":"#VALUE!"},{"$error":"#VALUE!"},{"$error":"#VALUE!"},{"$error":"#VALUE!"},{"$error":"#VALUE!"},{"$error":"#VALUE!"},{"$error":"#VALUE!"},{"$error":"#VALUE!"},{"$error":"#VALUE!"},{"$error":"#VALUE!"},{"$error":"#VALUE!"},{"$error":"#VALUE!"},{"$error":"#VALUE!"},{"$error":"#VALUE!"},{"$error":"#VALUE!"},{"$error":"#VALUE!"},{"$error":"#VALUE!"},{"$error":"#VALUE!"},{"$error":"#VALUE!"},{"$error":"#VALUE!"},{"$error":"#VALUE!"},{"$error":"#VALUE!"},{"$error":"#VALUE!"},{"$error":"#VALUE!"},{"$error":"#VALUE!"},{"$error":"#VALUE!"},{"$error":"#VALUE!"},{"$error":"#VALUE!"},{"$error":"#VALUE!"},{"$error":"#VALUE!"},{"$error":"#VALUE!"},{"$error":"#VALUE!"},{"$error":"#VALUE!"},{"$error":"#VALUE!"},{"$error":"#VALUE!"},{"$error":"#VALUE!"},{"$error":"#VALUE!"},{"$error":"#VALUE!"},{"$error":"#VALUE!"},{"$error":"#VALUE!"},{"$error":"#VALUE!"},{"$error":"#VALUE!"},{"$error":"#VALUE!"},{"$error":"#VALUE!"},{"$error":"#VALUE!"},{"$error":"#VALUE!"},{"$error":"#VALUE!"},{"$error":"#VALUE!"},{"$error":"#VALUE!"},{"$error":"#VALUE!"},{"$error":"#VALUE!"},{"$error":"#VALUE!"},{"$error":"#VALUE!"}]
["",{"$error":"#VALUE!"},{"$error":"#VALUE!"},{"$error":"#VALUE!"},{"$error":"#VALUE!"},{"$error":"#VALUE!"},{"$error":"#VALUE!"},{"$error":"#NUM!"},{"$error":"#VALUE!"},{"$error":"#VALUE!"},{"$error":"#VALUE!"},{"$error":"#NUM!"},{"$error":"#VALUE!"},{"$error":"#NUM!"},{"$error":"#NUM!"},{"$error":"#VALUE!"},{"$error":"#NUM!"},{"$error":"#VALUE!"},{"$error":"#NUM!"},{"$error":"#NUM!"},{"$error":"#VALUE!"},{"$error":"#NUM!"},{"$error":"#VALUE!"},{"$error":"#NUM!"},{"$error":"#NUM!"},{"$error":"#VALUE!"},{"$error":"#NUM!"},{"$error":"#VALUE!"},{"$error":"#NUM!"},{"$error":"#NUM!"},{"$error":"#VALUE!"},{"$error":"#NUM!"},{"$error":"#VALUE!"},{"$error":"#NUM!"},{"$error":"#NUM!"},{"$error":"#VALUE!"},{"$error":"#NUM!"},{"$error":"#VALUE!"},{"$error":"#NUM!"},{"$error":"#NUM!"},{"$error":"#VALUE!"},{"$error":"#NUM!"},{"$error":"#VALUE!"},{"$error":"#NUM!"},{"$error":"#NUM!"},{"$error":"#VALUE!"},{"$error":"#NUM!"},{"$error":"#DIV/0!"},{"$error":"#NUM!"},{"$error":"#NUM!"},{"$error":"#VALUE!"},{"$error":"#VALUE!"},{"$error":"#VALUE!"},{"$error":"#VALUE!"},{"$error":"#VALUE!"},{"$error":"#VALUE!"},{"$error":"#VALUE!"},{"$error":"#VALUE!"},{"$error":"#VALUE!"},{"$error":"#VALUE!"},{"$error":"#VALUE!"},{"$error":"#VALUE!"},{"$error":"#VALUE!"},{"$error":"#VALUE!"},{"$error":"#VALUE!"},{"$error":"#VALUE!"},{"$error":"#VALUE!"},{"$error":"#VALUE!"},{"$error":"#VALUE!"},{"$error":"#VALUE!"},{"$error":"#VALUE!"},{"$error":"#VALUE!"},{"$error":"#VALUE!"},{"$error":"#VALUE!"},{"$error":"#VALUE!"},{"$error":"#VALUE!"},{"$error":"#VALUE!"},{"$error":"#VALUE!"},{"$error":"#VALUE!"},{"$error":"#VALUE!"},{"$error":"#VALUE!"},{"$error":"#VALUE!"},{"$error":"#VALUE!"},{"$error":"#VALUE!"},{"$error":"#VALUE!"},{"$error":"#VALUE!"},{"$error":"#VALUE!"},{"$error":"#VALUE!"},{"$error":"#VALUE!"},{"$error":"#VALUE!"},{"$error":"#VALUE!"},{"$error":"#VALUE!"},{"$error":"#VALUE!"},{"$error":"#VALUE!"},{"$error":"#VALUE!"},{"$error":"#VALUE!"},{"$error":"#VALUE!"},{"$error":"#VALUE!"},{"$error":"#VALUE!"},{"$error":"#VALUE!"},{"$error":"#VALUE!"},{"$error":"#VALUE!"},{"$error":"#VALUE!"},{"$error":"#VALUE!"},{"$error":"#VALUE!"},{"$error":"#VALUE!"}]
[6.67,{"$error":"#DIV/0!"},0,{"$error":"#DIV/0!"},{"$error":"#DIV/0!"},{"$error":"#DIV/0!"},{"$error":"#DIV/0!"},{"$error":"#NUM!"},{"$error":"#DIV/0!"},{"$error":"#DIV/0!"},{"$error":"#VALUE!"},{"$error":"#NUM!"},{"$error":"#DIV/0!"},{"$error":"#NUM!"},{"$error":"#NUM!"},{"$error":"#VALUE!"},{"$error":"#NUM!"},{"$error":"#DIV/0!"},{"$error":"#NUM!"},{"$error":"#NUM!"},{"$error":"#VALUE!"},{"$error":"#NUM!"},{"$error":"#DIV/0!"},{"$error":"#NUM!"},{"$error":"#NUM!"},{"$error":"#VALUE!"},{"$error":"#NUM!"},{"$error":"#DIV/0!"},{"$error":"#NUM!"},{"$error":"#NUM!"},{"$error":"#VALUE!"},{"$error":"#NUM!"},{"$error":"#DIV/0!"},{"$error":"#NUM!"},{"$error":"#NUM!"},{"$error":"#VALUE!"},{"$error":"#NUM!"},{"$error":"#DIV/0!"},{"$error":"#NUM!"},{"$error":"#NUM!"},{"$error":"#VALUE!"},{"$error":"#NUM!"},{"$error":"#DIV/0!"},{"$error":"#NUM!"},{"$error":"#NUM!"},{"$error":"#VALUE!"},{"$error":"#NUM!"},{"$error":"#DIV/0!"},{"$error":"#NUM!"},{"$error":"#NUM!"},{"$error":"#VALUE!"},{"$error":"#DIV/0!"},{"$error":"#DIV/0!"},{"$error":"#DIV/0!"},{"$error":"#DIV/0!"},{"$error":"#VALUE!"},{"$error":"#DIV/0!"},{"$error":"#DIV/0!"},{"$error":"#DIV/0!"},{"$error":"#DIV/0!"},{"$error":"#VALUE!"},{"$error":"#DIV/0!"},{"$error":"#DIV/0!"},{"$error":"#DIV/0!"},{"$error":"#DIV/0!"},{"$error":"#VALUE!"},{"$error":"#DIV/0!"},{"$error":"#DIV/0!"},{"$error":"#DIV/0!"},{"$error":"#DIV/0!"},{"$error":"#VALUE!"},{"$error":"#DIV/0!"},{"$error":"#DIV/0!"},{"$error":"#DIV/0!"},{"$error":"#DIV/0!"},{"$error":"#VALUE!"},{"$error":"#DIV/0!"},{"$error":"#DIV/0!"},{"$error":"#DIV/0!"},{"$error":"#DIV/0!"},{"$error":"#VALUE!"},{"$error":"#DIV/0!"},{"$error":"#DIV/0!"},{"$error":"#DIV/0!"},{"$error":"#DIV/0!"},{"$error":"#VALUE!"},{"$error":"#DIV/0!"},{"$error":"#DIV/0!"},{"$error":"#DIV/0!"},{"$error":"#DIV/0!"},{"$error":"#VALUE!"},{"$error":"#DIV/0!"},{"$error":"#DIV/0!"},{"$error":"#DIV/0!"},{"$error":"#DIV/0!"},{"$error":"#VALUE!"},{"$error":"#DIV/0!"},{"$error":"#DIV/0!"},{"$error":"#DIV/0!"},{"$error":"#DIV/0!"},{"$error":"#VALUE!"},{"$error":"#DIV/0!"},{"$error":"#DIV/0!"},{"$error":"#DIV/0!"},{"$error":"#DIV/0!"},{"$error":"#VALUE!"}]
[""]
["",null,null,null,null,null,null,null,null,null,null,null,null,null,null,null,null,null,null,null,null,null,null,null,null,null,null,null,null,null,null,null,null,null,null,null,null,null,null,null,null,null,null,null,null,null,null,null,null,null,null,null,null," d (x)",{"$f":"def_cR*($E$39-BB$39)/($E$39-cR)","v":{"$error":"#DIV/0!"}},null,null,null," d (x)",{"$f":"def_cR*($E$39-BG$39)/($E$39-cR)","v":{"$error":"#DIV/0!"}},null,null,null," d (x)",{"$f":"def_cR*($E$39-BL$39)/($E$39-cR)","v":{"$error":"#DIV/0!"}},null,null,null," d (x)",{"$f":"def_cR*($E$39-BQ$39)/($E$39-cR)","v":{"$error":"#DIV/0!"}},null,null,null," d (x)",{"$f":"def_cR*($E$39-BV$39)/($E$39-cR)","v":{"$error":"#DIV/0!"}},null,null,null," d (x)",{"$f":"def_cR*($E$39-CA$39)/($E$39-cR)","v":{"$error":"#DIV/0!"}},null,null,null," d (x)",{"$f":"def_cR*($E$39-CF$39)/($E$39-cR)","v":{"$error":"#DIV/0!"}},null,null,null," d (x)",{"$f":"def_cR*($E$39-CK$39)/($E$39-cR)","v":{"$error":"#DIV/0!"}},null,null,null," d (x)",{"$f":"def_cR*($E$39-CP$39)/($E$39-cR)","v":{"$error":"#DIV/0!"}},null,null,null," d (x)",{"$f":"def_cR*($E$39-CU$39)/($E$39-cR)","v":{"$error":"#DIV/0!"}},null,null,null," d (x)",{"$f":"def_cR*($E$39-CZ$39)/($E$39-cR)","v":{"$error":"#DIV/0!"}}]
[null,null,null,null,null,null,null,null,null,null,null,null,null,null,null,null,null,null,null,null,null,null,null,null,null,null,null,null,null,null,null,null,null,null,null,null,null,null,null,null,null,null,null,null,null,null,null,null,null,null,null,null,null," d (slip)",{"$f":"IF((BB39-cR)<1,IF((BC53-BC48-SUM(BD39:BD46))<0,BC53-BC48-SUM(BD39:BD46),0),0)","v":{"$error":"#NUM!"}},null,null,null," d (slip)",{"$f":"IF((BG39-cR)<1,IF((BH53-BH48-SUM(BI39:BI46))<0,BH53-BH48-SUM(BI39:BI46),0),0)","v":{"$error":"#NUM!"}},null,null,null," d (slip)",{"$f":"IF((BL39-cR)<1,IF((BM53-BM48-SUM(BN39:BN46))<0,BM53-BM48-SUM(BN39:BN46),0),0)","v":{"$error":"#NUM!"}},null,null,null," d (slip)",{"$f":"IF((BQ39-cR)<1,IF((BR53-BR48-SUM(BS39:BS46))<0,BR53-BR48-SUM(BS39:BS46),0),0)","v":{"$error":"#NUM!"}},null,null,null," d (slip)",{"$f":"IF((BV39-cR)<1,IF((BW53-BW48-SUM(BX39:BX46))<0,BW53-BW48-SUM(BX39:BX46),0),0)","v":{"$error":"#NUM!"}},null,null,null," d (slip)",{"$f":"IF((CA39-cR)<1,IF((CB53-CB48-SUM(CC39:CC46))<0,CB53-CB48-SUM(CC39:CC46),0),0)","v":{"$error":"#NUM!"}},null,null,null," d (slip)",{"$f":"IF((CF39-cR)<1,IF((CG53-CG48-SUM(CH39:CH46))<0,CG53-CG48-SUM(CH39:CH46),0),0)","v":{"$error":"#NUM!"}},null,null,null," d (slip)",{"$f":"IF((CK39-cR)<1,IF((CL53-CL48-SUM(CM39:CM46))<0,CL53-CL48-SUM(CM39:CM46),0),0)","v":{"$error":"#NUM!"}},null,null,null," d (slip)",{"$f":"IF((CP39-cR)<1,IF((CQ53-CQ48-SUM(CR39:CR46))<0,CQ53-CQ48-SUM(CR39:CR46),0),0)","v":{"$error":"#NUM!"}},null,null,null," d (slip)",{"$f":"IF((CU39-cR)<=1,IF((CV53-CV48-SUM(CW39:CW46))<0,CV53-CV48-SUM(CW39:CW46),0),0)","v":{"$error":"#NUM!"}},null,null,null," d (slip)",{"$f":"DA53-SUM(DB39:DB46)-DA48","v":{"$error":"#NUM!"}}]
["D N",null,null,null,null,null,null,null,"D N",{"$f":"(((I39+G39)/2)-$B$39)*$B$30","v":{"$error":"#NUM!"}},null,null,null,"D N",{"$f":"(((N39+L39)/2)-$B$39)*C30","v":{"$error":"#NUM!"}},null,null,null,"D N",{"$f":"(((S39+Q39)/2)-$B$39)*D30","v":{"$error":"#NUM!"}},null,null,null,"D N",{"$f":"(((X39+V39)/2)-$B$39)*E30","v":{"$error":"#NUM!"}},null,null,null,"D N",{"$f":"(((AC39+AA39)/2)-$B$39)*F30","v":{"$error":"#NUM!"}},null,null,null,"D N",{"$f":"(((AH39+AF39)/2)-$B$39)*G30","v":{"$error":"#NUM!"}},null,null,null,"D N",{"$f":"(((AM39+AK39)/2)-$B$39)*H30","v":{"$error":"#NUM!"}},null,null,null,"D N",{"$f":"(((AR39+AP39)/2)-$B$39)*I30","v":{"$error":"#NUM!"}},null,null,null,"D N",{"$f":"(((AW39+AU39)/2)-$B$39)*J30","v":{"$error":"#NUM!"}},null,null,null,"D N",{"$f":"(((BB39+AZ39)/2)-$B$39)*K30","v":0},null,null,null,"D N",{"$f":"(((BG39+BE39)/2)-$B$39)*L30","v":0},null,null,null,"D N",{"$f":"(((BL39+BJ39)/2)-$B$39)*M30","v":0},null,null,null,"D N",{"$f":"(((BQ39+BO39)/2)-$B$39)*N30","v":0},null,null,null,"D N",{"$f":"(((BV39+BT39)/2)-$B$39)*O30","v":0},null,null,null,"D N",{"$f":"(((CA39+BY39)/2)-$B$39)*P30","v":0},null,null,null,"D N",{"$f":"(((CF39+CD39)/2)-$B$39)*Q30","v":0},null,null,null,"D N",{"$f":"(((CK39+CI39)/2)-$B$39)*R30","v":0},null,null,null,"D N",{"$f":"(((CP39+CN39)/2)-$B$39)*S30","v":0},null,null,null,"D N",{"$f":"(((CU39+CS39)/2)-$B$39)*T30","v":0},null,null,null,"D N",{"$f":"(((CZ39+CX39)/2)-$B$39)*U30","v":0}]
["SD N",null,null,null,null,null,null,null,"SD N",{"$f":"J50","v":{"$error":"#NUM!"}},null,null,null,"SD N",{"$f":"O50+J51","v":{"$error":"#NUM!"}},null,null,null,"SD N",{"$f":"T50+O51","v":{"$error":"#NUM!"}},null,null,null,"SD N",{"$f":"Y50+T51","v":{"$error":"#NUM!"}},null,null,null,"SD N",{"$f":"AD50+Y51","v":{"$error":"#NUM!"}},null,null,null,"SD N",{"$f":"AI50+AD51","v":{"$error":"#NUM!"}},null,null,null,"SD N",{"$f":"AN50+AI51","v":{"$error":"#NUM!"}},null,null,null,"SD N",{"$f":"AS50+AN51","v":{"$error":"#NUM!"}},null,null,null,"SD N",{"$f":"AX50+AS51","v":{"$error":"#NUM!"}},null,null,null,"SD N",{"$f":"AX51+BC50","v":{"$error":"#NUM!"}},null,null,null,"SD N",{"$f":"BC51+BH50","v":{"$error":"#NUM!"}},null,null,null,"SD N",{"$f":"BM50+BH51","v":{"$error":"#NUM!"}},null,null,null,"SD N",{"$f":"BR50+BM51","v":{"$error":"#NUM!"}},null,null,null,"SD N",{"$f":"BW50+BR51","v":{"$error":"#NUM!"}},null,null,null,"SD N",{"$f":"CB50+BW51","v":{"$error":"#NUM!"}},null,null,null,"SD N",{"$f":"CG50+CB51","v":{"$error":"#NUM!"}},null,null,null,"SD N",{"$f":"CL50+CG51","v":{"$error":"#NUM!"}},null,null,null,"SD N",{"$f":"CQ50+CL51","v":{"$error":"#NUM!"}},null,null,null,"SD N",{"$f":"CV50+CQ51","v":{"$error":"#NUM!"}},null,null,null,"SD N",{"$f":"DA50+CV51","v":{"$error":"#NUM!"}}]
[" d (N)",null,null,null,null,null,null,null," d (N)",{"$f":"(J50+0)/2*B30/Emean/Height","v":{"$error":"#NUM!"}},null,null,null," d (N)",{"$f":"(J51+O50/2)*C30/Emean/Height","v":{"$error":"#NUM!"}},null,null,null," d (N)",{"$f":"(O51+T50/2)*D30/Emean/Height","v":{"$error":"#NUM!"}},null,null,null," d (N)",{"$f":"(T51+Y50/2)*E30/Emean/Height","v":{"$error":"#NUM!"}},null,null,null," d (N)",{"$f":"(Y51+AD50/2)*F30/Emean/Height","v":{"$error":"#NUM!"}},null,null,null," d (N)",{"$f":"(AD51+AI50/2)*G30/Emean/Height","v":{"$error":"#NUM!"}},null,null,null," d (N)",{"$f":"(AI51+AN50/2)*H30/Emean/Height","v":{"$error":"#NUM!"}},null,null,null," d (N)",{"$f":"(AN51+AS50/2)*I30/Emean/Height","v":{"$error":"#NUM!"}},null,null,null," d (N)",{"$f":"(AS51+AX50/2)*J30/Emean/Height","v":{"$error":"#NUM!"}},null,null,null," d (N)",{"$f":"(AX51+BC50/2)*K30/Emean/Height","v":{"$error":"#NUM!"}},null,null,null," d (N)",{"$f":"(BC51+BH50/2)*L30/Emean/Height","v":{"$error":"#NUM!"}},null,null,null," d (N)",{"$f":"(BH51+BM50/2)*M30/Emean/Height","v":{"$error":"#NUM!"}},null,null,null," d (N)",{"$f":"(BM51+BR50/2)*N30/Emean/Height","v":{"$error":"#NUM!"}},null,null,null," d (N)",{"$f":"(BR51+BW50/2)*O30/Emean/Height","v":{"$error":"#NUM!"}},null,null,null," d (N)",{"$f":"(BW51+CB50/2)*P30/Emean/Height","v":{"$error":"#NUM!"}},null,null,null," d (N)",{"$f":"(CB51+CG50/2)*Q30/Emean/Height","v":{"$error":"#NUM!"}},null,null,null," d (N)",{"$f":"(CG51+CL50/2)*R30/Emean/Height","v":{"$error":"#NUM!"}},null,null,null," d (N)",{"$f":"(CL51+CQ50/2)*S30/Emean/Height","v":{"$error":"#NUM!"}},null,null,null," d (N)",{"$f":"(CQ51+CV50/2)*T30/Emean/Height","v":{"$error":"#NUM!"}},null,null,null," d (N)",{"$f":"(CV51+DA50/2)*U30/Emean/Height","v":{"$error":"#NUM!"}}]
["S d (N)",null,null,null,null,null,null,null,"S d (N)",{"$f":"J52","v":{"$error":"#NUM!"}},null,null,null,"S d (N)",{"$f":"O52+J53","v":{"$error":"#NUM!"}},null,null,null,"S d (N)",{"$f":"T52+O53","v":{"$error":"#NUM!"}},null,null,null,"S d (N)",{"$f":"Y52+T53","v":{"$error":"#NUM!"}},null,null,null,"S d (N)",{"$f":"AD52+Y53","v":{"$error":"#NUM!"}},null,null,null,"S d (N)",{"$f":"AI52+AD53","v":{"$error":"#NUM!"}},null,null,null,"S d (N)",{"$f":"AN52+AI53","v":{"$error":"#NUM!"}},null,null,null,"S d (N)",{"$f":"AS52+AN53","v":{"$error":"#NUM!"}},null,null,null,"S d (N)",{"$f":"AX52+AS53","v":{"$error":"#NUM!"}},null,null,null,"S d (N)",{"$f":"BC52+AX53","v":{"$error":"#NUM!"}},null,null,null,"S d (N)",{"$f":"BH52+BC53","v":{"$error":"#NUM!"}},null,null,null,"S d (N)",{"$f":"BM52+BH53","v":{"$error":"#NUM!"}},null,null,null,"S d (N)",{"$f":"BR52+BM53","v":{"$error":"#NUM!"}},null,null,null,"S d (N)",{"$f":"BW52+BR53","v":{"$error":"#NUM!"}},null,null,null,"S d (N)",{"$f":"CB52+BW53","v":{"$error":"#NUM!"}},null,null,null,"S d (N)",{"$f":"CG52+CB53","v":{"$error":"#NUM!"}},null,null,null,"S d (N)",{"$f":"CL52+CG53","v":{"$error":"#NUM!"}},null,null,null,"S d (N)",{"$f":"CQ52+CL53","v":{"$error":"#NUM!"}},null,null,null,"S d (N)",{"$f":"CV52+CQ53","v":{"$error":"#NUM!"}},null,null,null,"S d (N)",{"$f":"DA52+CV53","v":{"$error":"#NUM!"}}]
["S d (t)",null,null,null,null,null,null,null,"S d (t)",{"$f":"SUM(def)","v":{"$error":"#VALUE!"}},null,null,null,"S d (t)",{"$f":"SUM(P39:P49)","v":{"$error":"#VALUE!"}},null,null,null,"S d (t)",{"$f":"SUM(U39:U49)","v":{"$error":"#VALUE!"}},null,null,null,"S d (t)",{"$f":"SUM(Z39:Z49)","v":{"$error":"#VALUE!"}},null,null,null,"S d (t)",{"$f":"SUM(AE39:AE49)","v":{"$error":"#VALUE!"}},null,null,null,"S d (t)",{"$f":"SUM(AJ39:AJ49)","v":{"$error":"#VALUE!"}},null,null,null,"S d (t)",{"$f":"SUM(AO39:AO49)","v":{"$error":"#VALUE!"}},null,null,null,"S d (t)",{"$f":"SUM(AT39:AT49)","v":{"$error":"#VALUE!"}},null,null,null,"S d (t)",{"$f":"SUM(AY39:AY49)","v":{"$error":"#VALUE!"}},null,null,null,"S d (t)",{"$f":"SUM(BD39:BD47)+BC48+BC49","v":{"$error":"#VALUE!"}},null,null,null,"S d (t)",{"$f":"SUM(BI39:BI47)+BH48+BH49","v":{"$error":"#VALUE!"}},null,null,null,"S d (t)",{"$f":"SUM(BN39:BN47)+BM48+BM49","v":{"$error":"#VALUE!"}},null,null,null,"S d (t)",{"$f":"SUM(BS39:BS47)+BR48+BR49","v":{"$error":"#VALUE!"}},null,null,null,"S d (t)",{"$f":"SUM(BX39:BX47)+BW48+BW49","v":{"$error":"#VALUE!"}},null,null,null,"S d (t)",{"$f":"SUM(CC39:CC47)+CB48+CB49","v":{"$error":"#VALUE!"}},null,null,null,"S d (t)",{"$f":"SUM(CH39:CH47)+CG48+CG49","v":{"$error":"#VALUE!"}},null,null,null,"S d (t)",{"$f":"SUM(CM39:CM47)+CL48+CL49","v":{"$error":"#VALUE!"}},null,null,null,"S d (t)",{"$f":"SUM(CR39:CR47)+CQ48+CQ49","v":{"$error":"#VALUE!"}},null,null,null,"S d (t)",{"$f":"SUM(CW39:CW47)+CV48+CV49","v":{"$error":"#VALUE!"}},null,null,null,"S d (t)",{"$f":"SUM(DB39:DB47)+DA48+DA49","v":{"$error":"#VALUE!"}}]
["Difference",null,"sum stage I",{"$f":"SUM(I55:AX55)","v":{"$error":"#NUM!"}},null,null,null,null,null,{"$f":"ABS(J53-J54)*10000","v":{"$error":"#NUM!"}},null,null,null,null,{"$f":"ABS(O53-O54)*10000","v":{"$error":"#NUM!"}},null,null,null,null,{"$f":"ABS(T53-T54)*10000","v":{"$error":"#NUM!"}},null,null,null,null,{"$f":"ABS(Y53-Y54)*10000","v":{"$error":"#NUM!"}},null,null,null,null,{"$f":"ABS(AD53-AD54)*10000","v":{"$error":"#NUM!"}},null,null,null,null,{"$f":"ABS(AI53-AI54)*10000","v":{"$error":"#NUM!"}},null,null,null,null,{"$f":"ABS(AN53-AN54)*10000","v":{"$error":"#NUM!"}},null,null,null,null,{"$f":"ABS(AS53-AS54)*10000","v":{"$error":"#NUM!"}},null,null,null,null,{"$f":"ABS(AX53-AX54)*10000","v":{"$error":"#NUM!"}},null,null,null,null,{"$f":"ABS(BC53-BC54)*10000","v":{"$error":"#NUM!"}},null,null,null,null,{"$f":"ABS(BH53-BH54)*10000","v":{"$error":"#NUM!"}},null,null,null,null,{"$f":"ABS(BM53-BM54)*10000","v":{"$error":"#NUM!"}},null,null,null,null,{"$f":"ABS(BR53-BR54)*10000","v":{"$error":"#NUM!"}},null,null,null,null,{"$f":"ABS(BW53-BW54)*10000","v":{"$error":"#NUM!"}},null,null,null,null,{"$f":"ABS(CB53-CB54)*10000","v":{"$error":"#NUM!"}},null,null,null,null,{"$f":"ABS(CG53-CG54)*10000","v":{"$error":"#NUM!"}},null,null,null,null,{"$f":"ABS(CL53-CL54)*10000","v":{"$error":"#NUM!"}},null,null,null,null,{"$f":"ABS(CQ53-CQ54)*10000","v":{"$error":"#NUM!"}},null,null,null,null,{"$f":"ABS(CV53-CV54)*10000","v":{"$error":"#NUM!"}},null,null,null,null,{"$f":"ABS(DA53-DA54)*10000","v":{"$error":"#NUM!"}}]
["Compatibility",null,"sum stage II",{"$f":"SUM(BC55:DA55)","v":{"$error":"#NUM!"}},null,null,null,null,null,{"$f":"IF(ABS(J55)<=0.5,\"Ok\",\"Not ok\")","v":{"$error":"#NUM!"}},null,null,null,null,{"$f":"IF(ABS(O55)<=0.5,\"Ok\",\"Not ok\")","v":{"$error":"#NUM!"}},null,null,null,null,{"$f":"IF(ABS(T55)<=0.5,\"Ok\",\"Not ok\")","v":{"$error":"#NUM!"}},null,null,null,null,{"$f":"IF(ABS(Y55)<=0.5,\"Ok\",\"Not ok\")","v":{"$error":"#NUM!"}},null,null,null,null,{"$f":"IF(ABS(AD55)<=0.5,\"Ok\",\"Not ok\")","v":{"$error":"#NUM!"}},null,null,null,null,{"$f":"IF(ABS(AI55)<=0.5,\"Ok\",\"Not ok\")","v":{"$error":"#NUM!"}},null,null,null,null,{"$f":"IF(ABS(AN55)<=0.5,\"Ok\",\"Not ok\")","v":{"$error":"#NUM!"}},null,null,null,null,{"$f":"IF(ABS(AS55)<=0.5,\"Ok\",\"Not ok\")","v":{"$error":"#NUM!"}},null,null,null,null,{"$f":"IF(ABS(AX55)<=0.5,\"Ok\",\"Not ok\")","v":{"$error":"#NUM!"}},null,null,null,null,{"$f":"IF(ABS(BC55)<=0.5,\"Ok\",\"Not ok\")","v":{"$error":"#NUM!"}},null,null,null,null,{"$f":"IF(ABS(BH55)<=0.5,\"Ok\",\"Not ok\")","v":{"$error":"#NUM!"}},null,null,null,null,{"$f":"IF(ABS(BM55)<=0.5,\"Ok\",\"Not ok\")","v":{"$error":"#NUM!"}},null,null,null,null,{"$f":"IF(ABS(BR55)<=0.5,\"Ok\",\"Not ok\")","v":{"$error":"#NUM!"}},null,null,null,null,{"$f":"IF(ABS(BW55)<=0.5,\"Ok\",\"Not ok\")","v":{"$error":"#NUM!"}},null,null,null,null,{"$f":"IF(ABS(CB55)<=0.5,\"Ok\",\"Not ok\")","v":{"$error":"#NUM!"}},null,null,null,null,{"$f":"IF(ABS(CG55)<=0.5,\"Ok\",\"Not ok\")","v":{"$error":"#NUM!"}},null,null,null,null,{"$f":"IF(ABS(CL55)<=0.5,\"Ok\",\"Not ok\")","v":{"$error":"#NUM!"}},null,null,null,null,{"$f":"IF(ABS(CQ55)<=0.5,\"Ok\",\"Not ok\")","v":{"$error":"#NUM!"}},null,null,null,null,{"$f":"IF(ABS(CV55)<=0.5,\"Ok\",\"Not ok\")","v":{"$error":"#NUM!"}},null,null,null,null,{"$f":"IF(ABS(DA55)<=0.5,\"Ok\",\"Not ok\")","v":{"$error":"#NUM!"}}]
[null,null,"Both",{"$f":"D55+D56","v":{"$error":"#NUM!"}}]
[]
["t(x,z)"]
[null,null,"Stage I",null,null,null,null,null,null,null,null,"Stage II"]
[null,"start value","Dx1","Dx2","Dx3","Dx4","Dx5","Dx6","Dx7","Dx8","Dx9","Dx10","Dx11","Dx12","Dx13","Dx14","Dx15","Dx16","Dx17","Dx18","Dx19","Dx20","SDx"]
["Distance from X=0",0,{"$f":"($B$32+$C$32)/2","v":18},{"$f":"($C$32+$D$32)/2","v":44.5},{"$f":"($D$32+$E$32)/2","v":58},{"$f":"($E$32+$F$32)/2","v":66.5},{"$f":"($F$32+$G$32)/2","v":72.5},{"$f":"($G$32+$H$32)/2","v":77.5},{"$f":"($H$32+$I$32)/2","v":82},{"$f":"($I$32+$J$32)/2","v":85.5},{"$f":"($J$32+$K$32)/2","v":90},{"$f":"($K$32+$L$32)/2","v":94.5},{"$f":"($L$32+$M$32)/2","v":97.5},{"$f":"($M$32+$N$32)/2","v":100},{"$f":"($N$32+$O$32)/2","v":102},{"$f":"($O$32+$P$32)/2","v":104},{"$f":"($P$32+$Q$32)/2","v":106.5},{"$f":"($Q$32+$R$32)/2","v":109},{"$f":"($R$32+$S$32)/2","v":111},{"$f":"($S$32+$T$32)/2","v":113},{"$f":"($T$32+$U$32)/2","v":114}]
["Z från slip surface"]
[0,0,{"$f":"OFFSET($G39,0,(COLUMN(B1)-COLUMN($B$1))*5)","v":0},{"$error":"#NUM!"},{"$error":"#NUM!"},{"$error":"#NUM!"},{"$error":"#NUM!"},{"$error":"#NUM!"},{"$error":"#NUM!"},{"$error":"#NUM!"},{"$error":"#NUM!"},0,0,0,0,0,0,0,0,0,0,0]
[{"$f":"IF(A64<Height/3,A64+1,\"\")","v":""},0,{"$error":"#VALUE!"},{"$f":"OFFSET($G40,0,(COLUMN(cS)-COLUMN($B$1))*5)","v":{"$error":"#NUM!"}},{"$error":"#NUM!"},{"$error":"#NUM!"},{"$error":"#NUM!"},{"$error":"#NUM!"},{"$error":"#NUM!"},{"$error":"#NUM!"},{"$error":"#NUM!"},{"$error":"#VALUE!"},{"$error":"#VALUE!"},{"$error":"#VALUE!"},{"$error":"#VALUE!"},{"$error":"#VALUE!"},{"$error":"#VALUE!"},{"$error":"#VALUE!"},{"$error":"#VALUE!"},{"$error":"#VALUE!"},{"$error":"#VALUE!"},{"$error":"#VALUE!"}]
["",0,{"$error":"#VALUE!"},{"$f":"OFFSET($G41,0,(COLUMN(C3)-COLUMN($B$1))*5)","v":{"$error":"#NUM!"}},{"$f":"OFFSET($G41,0,(COLUMN(D3)-COLUMN($B$1))*5)","v":{"$error":"#NUM!"}},{"$f":"OFFSET($G41,0,(COLUMN(#REF!)-COLUMN($B$1))*5)","v":{"$error":"#REF!"}},{"$f":"OFFSET($G41,0,(COLUMN(#REF!)-COLUMN($B$1))*5)","v":{"$error":"#REF!"}},{"$f":"OFFSET($G41,0,(COLUMN(#REF!)-COLUMN($B$1))*5)","v":{"$error":"#REF!"}},{"$f":"OFFSET($G41,0,(COLUMN(#REF!)-COLUMN($B$1))*5)","v":{"$error":"#REF!"}},{"$error":"#NUM!"},{"$error":"#NUM!"},{"$error":"#VALUE!"},{"$error":"#VALUE!"},{"$error":"#VALUE!"},{"$error":"#VALUE!"},{"$error":"#VALUE!"},{"$error":"#VALUE!"},{"$error":"#VALUE!"},{"$error":"#VALUE!"},{"$error":"#VALUE!"},{"$error":"#VALUE!"},{"$error":"#VALUE!"}]
["",0,{"$error":"#VALUE!"},{"$f":"OFFSET($G42,0,(COLUMN(c_peak)-COLUMN($B$1))*5)","v":{"$error":"#NUM!"}},{"$f":"OFFSET($G42,0,(COLUMN(D4)-COLUMN($B$1))*5)","v":{"$error":"#NUM!"}},{"$error":"#NUM!"},{"$error":"#NUM!"},{"$error":"#NUM!"},{"$error":"#NUM!"},{"$error":"#NUM!"},{"$error":"#NUM!"},{"$error":"#VALUE!"},{"$error":"#VALUE!"},{"$error":"#VALUE!"},{"$error":"#VALUE!"},{"$error":"#VALUE!"},{"$error":"#VALUE!"},{"$error":"#VALUE!"},{"$error":"#VALUE!"},{"$error":"#VALUE!"},{"$error":"#VALUE!"},{"$error":"#VALUE!"}]
["",0,{"$error":"#VALUE!"},{"$f":"OFFSET($G43,0,(COLUMN(cR)-COLUMN($B$1))*5)","v":{"$error":"#NUM!"}},{"$error":"#NUM!"},{"$error":"#NUM!"},{"$error":"#NUM!"},{"$error":"#NUM!"},{"$error":"#NUM!"},{"$error":"#NUM!"},{"$error":"#NUM!"},{"$error":"#VALUE!"},{"$error":"#VALUE!"},{"$error":"#VALUE!"},{"$error":"#VALUE!"},{"$error":"#VALUE!"},{"$error":"#VALUE!"},{"$error":"#VALUE!"},{"$error":"#VALUE!"},{"$error":"#VALUE!"},{"$error":"#VALUE!"},{"$error":"#VALUE!"}]
["",0,{"$error":"#VALUE!"},{"$f":"OFFSET($G44,0,(COLUMN(tel)-COLUMN($B$1))*5)","v":{"$error":"#NUM!"}},{"$error":"#NUM!"},{"$error":"#NUM!"},{"$error":"#NUM!"},{"$error":"#NUM!"},{"$error":"#NUM!"},{"$error":"#NUM!"},{"$error":"#NUM!"},{"$error":"#VALUE!"},{"$error":"#VALUE!"},{"$error":"#VALUE!"},{"$error":"#VALUE!"},{"$error":"#VALUE!"},{"$error":"#VALUE!"},{"$error":"#VALUE!"},{"$error":"#VALUE!"},{"$error":"#VALUE!"},{"$error":"#VALUE!"},{"$error":"#VALUE!"}]
["",0,{"$error":"#VALUE!"},{"$f":"OFFSET($G45,0,(COLUMN(gel)-COLUMN($B$1))*5)","v":{"$error":"#NUM!"}},{"$error":"#NUM!"},{"$error":"#NUM!"},{"$error":"#NUM!"},{"$error":"#NUM!"},{"$error":"#NUM!"},{"$error":"#NUM!"},{"$error":"#NUM!"},{"$error":"#VALUE!"},{"$error":"#VALUE!"},{"$error":"#VALUE!"},{"$error":"#VALUE!"},{"$error":"#VALUE!"},{"$error":"#VALUE!"},{"$error":"#VALUE!"},{"$error":"#VALUE!"},{"$error":"#VALUE!"},{"$error":"#VALUE!"},{"$error":"#VALUE!"}]
["",0,{"$error":"#DIV/0!"},{"$f":"OFFSET($G46,0,(COLUMN(g_f)-COLUMN($B$1))*5)","v":{"$error":"#NUM!"}},{"$error":"#NUM!"},{"$error":"#NUM!"},{"$error":"#NUM!"},{"$error":"#NUM!"},{"$error":"#NUM!"},{"$error":"#NUM!"},{"$error":"#NUM!"},{"$error":"#DIV/0!"},{"$error":"#DIV/0!"},{"$error":"#DIV/0!"},{"$error":"#DIV/0!"},{"$error":"#DIV/0!"},{"$error":"#DIV/0!"},{"$error":"#DIV/0!"},{"$error":"#DIV/0!"},{"$error":"#DIV/0!"},{"$error":"#DIV/0!"},{"$error":"#DIV/0!"}]
[""]
[""]
[""]
["Dt"]
[null,null,"Stage I",null,null,null,null,null,null,null,null,"Stage II"]
[null,"start value","Dx1","Dx2","Dx3","Dx4","Dx5","Dx6","Dx7","Dx8","Dx9","Dx10","Dx11","Dx12","Dx13","Dx14","Dx15","Dx16","Dx17","Dx18","Dx19","Dx20","SDx"]
["Distance from X=0",0,{"$f":"($B$32+$C$32)/2","v":18},{"$f":"($C$32+$D$32)/2","v":44.5},{"$f":"($D$32+$E$32)/2","v":58},{"$f":"($E$32+$F$32)/2","v":66.5},{"$f":"($F$32+$G$32)/2","v":72.5},{"$f":"($G$32+$H$32)/2","v":77.5},{"$f":"($H$32+$I$32)/2","v":82},{"$f":"($I$32+$J$32)/2","v":85.5},{"$f":"($J$32+$K$32)/2","v":90},{"$f":"($K$32+$L$32)/2","v":94.5},{"$f":"($L$32+$M$32)/2","v":97.5},{"$f":"($M$32+$N$32)/2","v":100},{"$f":"($N$32+$O$32)/2","v":102},{"$f":"($O$32+$P$32)/2","v":104},{"$f":"($P$32+$Q$32)/2","v":106.5},{"$f":"($Q$32+$R$32)/2","v":109},{"$f":"($R$32+$S$32)/2","v":111},{"$f":"($S$32+$T$32)/2","v":113},{"$f":"($T$32+$U$32)/2","v":114}]
["Z från slip surface"]
[0,0,{"$f":"OFFSET($H39,0,(COLUMN(B$1)-COLUMN($B$1))*5)","v":{"$error":"#NUM!"}},0,0,0,0,0,0,0,{"$error":"#DIV/0!"},0,0,0,0,0,0,0,0,0,0,0]
[{"$f":"IF(A80<Height/3,A80+1,\"\")","v":""},0,{"$error":"#NUM!"},{"$error":"#VALUE!"},{"$error":"#VALUE!"},{"$error":"#VALUE!"},{"$error":"#VALUE!"},{"$error":"#VALUE!"},{"$error":"#VALUE!"},{"$error":"#VALUE!"},{"$error":"#DIV/0!"},{"$error":"#VALUE!"},{"$error":"#VALUE!"},{"$error":"#VALUE!"},{"$error":"#VALUE!"},{"$error":"#VALUE!"},{"$error":"#VALUE!"},{"$error":"#VALUE!"},{"$error":"#VALUE!"},{"$error":"#VALUE!"},{"$error":"#VALUE!"},{"$error":"#VALUE!"}]
["",0,{"$error":"#NUM!"},{"$error":"#VALUE!"},{"$error":"#VALUE!"},{"$error":"#VALUE!"},{"$error":"#VALUE!"},{"$error":"#VALUE!"},{"$error":"#VALUE!"},{"$error":"#VALUE!"},{"$error":"#DIV/0!"},{"$error":"#VALUE!"},{"$error":"#VALUE!"},{"$error":"#VALUE!"},{"$error":"#VALUE!"},{"$error":"#VALUE!"},{"$error":"#VALUE!"},{"$error":"#VALUE!"},{"$error":"#VALUE!"},{"$error":"#VALUE!"},{"$error":"#VALUE!"},{"$error":"#VALUE!"}]
["",0,{"$error":"#NUM!"},{"$error":"#VALUE!"},{"$error":"#VALUE!"},{"$error":"#VALUE!"},{"$error":"#VALUE!"},{"$error":"#VALUE!"},{"$error":"#VALUE!"},{"$error":"#VALUE!"},{"$error":"#DIV/0!"},{"$error":"#VALUE!"},{"$error":"#VALUE!"},{"$error":"#VALUE!"},{"$error":"#VALUE!"},{"$error":"#VALUE!"},{"$error":"#VALUE!"},{"$error":"#VALUE!"},{"$error":"#VALUE!"},{"$error":"#VALUE!"},{"$error":"#VALUE!"},{"$error":"#VALUE!"}]
["",0,{"$error":"#NUM!"},{"$error":"#VALUE!"},{"$error":"#VALUE!"},{"$error":"#VALUE!"},{"$error":"#VALUE!"},{"$error":"#VALUE!"},{"$error":"#VALUE!"},{"$error":"#VALUE!"},{"$error":"#DIV/0!"},{"$error":"#VALUE!"},{"$error":"#VALUE!"},{"$error":"#VALUE!"},{"$error":"#VALUE!"},{"$error":"#VALUE!"},{"$error":"#VALUE!"},{"$error":"#VALUE!"},{"$error":"#VALUE!"},{"$error":"#VALUE!"},{"$error":"#VALUE!"},{"$error":"#VALUE!"}]
["",0,{"$error":"#NUM!"},{"$error":"#VALUE!"},{"$error":"#VALUE!"},{"$error":"#VALUE!"},{"$error":"#VALUE!"},{"$error":"#VALUE!"},{"$error":"#VALUE!"},{"$error":"#VALUE!"},{"$error":"#DIV/0!"},{"$error":"#VALUE!"},{"$error":"#VALUE!"},{"$error":"#VALUE!"},{"$error":"#VALUE!"},{"$error":"#VALUE!"},{"$error":"#VALUE!"},{"$error":"#VALUE!"},{"$error":"#VALUE!"},{"$error":"#VALUE!"},{"$error":"#VALUE!"},{"$error":"#VALUE!"}]
["",0,{"$error":"#NUM!"},{"$error":"#VALUE!"},{"$error":"#VALUE!"},{"$error":"#VALUE!"},{"$error":"#VALUE!"},{"$error":"#VALUE!"},{"$error":"#VALUE!"},{"$error":"#VALUE!"},{"$error":"#DIV/0!"},{"$error":"#VALUE!"},{"$error":"#VALUE!"},{"$error":"#VALUE!"},{"$error":"#VALUE!"},{"$error":"#VALUE!"},{"$error":"#VALUE!"},{"$error":"#VALUE!"},{"$error":"#VALUE!"},{"$error":"#VALUE!"},{"$error":"#VALUE!"},{"$error":"#VALUE!"}]
["",0,{"$error":"#NUM!"},{"$error":"#DIV/0!"},{"$error":"#DIV/0!"},{"$error":"#DIV/0!"},{"$error":"#DIV/0!"},{"$error":"#DIV/0!"},{"$error":"#DIV/0!"},{"$error":"#DIV/0!"},{"$error":"#DIV/0!"},{"$error":"#DIV/0!"},{"$error":"#DIV/0!"},{"$error":"#DIV/0!"},{"$error":"#DIV/0!"},{"$error":"#DIV/0!"},{"$error":"#DIV/0!"},{"$error":"#DIV/0!"},{"$error":"#DIV/0!"},{"$error":"#DIV/0!"},{"$error":"#DIV/0!"},{"$error":"#DIV/0!"}]
[""]
[""]
[""]
["t+Dt"]
[null,null,"Stage I",null,null,null,null,null,null,null,null,"Stage II"]
[null,null,"Dx1","Dx2","Dx3","Dx4","Dx5","Dx6","Dx7","Dx8","Dx9","Dx10","Dx11","Dx12","Dx13","Dx14","Dx15","Dx16","Dx17","Dx18","Dx19","Dx20","SDx"]
["Distance from x=0",null,{"$f":"($B$32+$C$32)/2","v":18},{"$f":"($C$32+$D$32)/2","v":44.5},{"$f":"($D$32+$E$32)/2","v":58},{"$f":"($E$32+$F$32)/2","v":66.5},{"$f":"($F$32+$G$32)/2","v":72.5},{"$f":"($G$32+$H$32)/2","v":77.5},{"$f":"($H$32+$I$32)/2","v":82},{"$f":"($I$32+$J$32)/2","v":85.5},{"$f":"($J$32+$K$32)/2","v":90},{"$f":"($K$32+$L$32)/2","v":94.5},{"$f":"($L$32+$M$32)/2","v":97.5},{"$f":"($M$32+$N$32)/2","v":100},{"$f":"($N$32+$O$32)/2","v":102},{"$f":"($O$32+$P$32)/2","v":104},{"$f":"($P$32+$Q$32)/2","v":106.5},{"$f":"($Q$32+$R$32)/2","v":109},{"$f":"($R$32+$S$32)/2","v":111},{"$f":"($S$32+$T$32)/2","v":113},{"$f":"($T$32+$U$32)/2","v":114}]
["Z från slip surface"]
[0,null,{"$f":"OFFSET($I39,0,(COLUMN(B$1)-COLUMN($B$1))*5)","v":{"$error":"#NUM!"}},{"$error":"#NUM!"},{"$error":"#NUM!"},{"$error":"#NUM!"},{"$error":"#NUM!"},{"$error":"#NUM!"},{"$error":"#NUM!"},{"$error":"#NUM!"},{"$error":"#NUM!"},0,0,0,0,0,0,0,0,0,0,0]
[{"$f":"IF(A96<Height/3,A96+1,\"\")","v":""},null,{"$error":"#VALUE!"},{"$error":"#NUM!"},{"$error":"#NUM!"},{"$error":"#NUM!"},{"$error":"#NUM!"},{"$error":"#NUM!"},{"$error":"#NUM!"},{"$error":"#NUM!"},{"$error":"#NUM!"},{"$error":"#VALUE!"},{"$error":"#VALUE!"},{"$error":"#VALUE!"},{"$error":"#VALUE!"},{"$error":"#VALUE!"},{"$error":"#VALUE!"},{"$error":"#VALUE!"},{"$error":"#VALUE!"},{"$error":"#VALUE!"},{"$error":"#VALUE!"},{"$error":"#VALUE!"}]
["",null,{"$error":"#VALUE!"},{"$error":"#NUM!"},{"$error":"#NUM!"},{"$error":"#NUM!"},{"$error":"#NUM!"},{"$error":"#NUM!"},{"$error":"#NUM!"},{"$error":"#NUM!"},{"$error":"#NUM!"},{"$error":"#VALUE!"},{"$error":"#VALUE!"},{"$error":"#VALUE!"},{"$error":"#VALUE!"},{"$error":"#VALUE!"},{"$error":"#VALUE!"},{"$error":"#VALUE!"},{"$error":"#VALUE!"},{"$error":"#VALUE!"},{"$error":"#VALUE!"},{"$error":"#VALUE!"}]
["",null,{"$error":"#VALUE!"},{"$error":"#NUM!"},{"$error":"#NUM!"},{"$error":"#NUM!"},{"$error":"#NUM!"},{"$error":"#NUM!"},{"$error":"#NUM!"},{"$error":"#NUM!"},{"$error":"#NUM!"},{"$error":"#VALUE!"},{"$error":"#VALUE!"},{"$error":"#VALUE!"},{"$error":"#VALUE!"},{"$error":"#VALUE!"},{"$error":"#VALUE!"},{"$error":"#VALUE!"},{"$error":"#VALUE!"},{"$error":"#VALUE!"},{"$error":"#VALUE!"},{"$error":"#VALUE!"}]
["",null,{"$error":"#VALUE!"},{"$error":"#NUM!"},{"$error":"#NUM!"},{"$error":"#NUM!"},{"$error":"#NUM!"},{"$error":"#NUM!"},{"$error":"#NUM!"},{"$error":"#NUM!"},{"$error":"#NUM!"},{"$error":"#VALUE!"},{"$error":"#VALUE!"},{"$error":"#VALUE!"},{"$error":"#VALUE!"},{"$error":"#VALUE!"},{"$error":"#VALUE!"},{"$error":"#VALUE!"},{"$error":"#VALUE!"},{"$error":"#VALUE!"},{"$error":"#VALUE!"},{"$error":"#VALUE!"}]
["",null,{"$error":"#VALUE!"},{"$error":"#NUM!"},{"$error":"#NUM!"},{"$error":"#NUM!"},{"$error":"#NUM!"},{"$error":"#NUM!"},{"$error":"#NUM!"},{"$error":"#NUM!"},{"$error":"#NUM!"},{"$error":"#VALUE!"},{"$error":"#VALUE!"},{"$error":"#VALUE!"},{"$error":"#VALUE!"},{"$error":"#VALUE!"},{"$error":"#VALUE!"},{"$error":"#VALUE!"},{"$error":"#VALUE!"},{"$error":"#VALUE!"},{"$error":"#VALUE!"},{"$error":"#VALUE!"}]
["",null,{"$error":"#VALUE!"},{"$error":"#NUM!"},{"$error":"#NUM!"},{"$error":"#NUM!"},{"$error":"#NUM!"},{"$error":"#NUM!"},{"$error":"#NUM!"},{"$error":"#NUM!"},{"$error":"#NUM!"},{"$error":"#VALUE!"},{"$error":"#VALUE!"},{"$error":"#VALUE!"},{"$error":"#VALUE!"},{"$error":"#VALUE!"},{"$error":"#VALUE!"},{"$error":"#VALUE!"},{"$error":"#VALUE!"},{"$error":"#VALUE!"},{"$error":"#VALUE!"},{"$error":"#VALUE!"}]
["",null,{"$error":"#DIV/0!"},{"$error":"#NUM!"},{"$error":"#NUM!"},{"$error":"#NUM!"},{"$error":"#NUM!"},{"$error":"#NUM!"},{"$error":"#NUM!"},{"$error":"#NUM!"},{"$error":"#NUM!"},{"$error":"#DIV/0!"},{"$error":"#DIV/0!"},{"$error":"#DIV/0!"},{"$error":"#DIV/0!"},{"$error":"#DIV/0!"},{"$error":"#DIV/0!"},{"$error":"#DIV/0!"},{"$error":"#DIV/0!"},{"$error":"#DIV/0!"},{"$error":"#DIV/0!"},{"$error":"#DIV/0!"}]
[""]
[{"$f":"IF(#REF!<Height/3,#REF!+1,\"\")","v":{"$error":"#REF!"}}]
["g(t)"]
[null,null,"Stage I",null,null,null,null,null,null,null,null,"Stage II"]
[null,"start value","Dx1","Dx2","Dx3","Dx4","Dx5","Dx6","Dx7","Dx8","Dx9","Dx10","Dx11","Dx12","Dx13","Dx14","Dx15","Dx16","Dx17","Dx18","Dx19","Dx20","SDx"]
["Distance from X=0",null,{"$f":"($B$32+$C$32)/2","v":18},{"$f":"($C$32+$D$32)/2","v":44.5},{"$f":"($D$32+$E$32)/2","v":58},{"$f":"($E$32+$F$32)/2","v":66.5},{"$f":"($F$32+$G$32)/2","v":72.5},{"$f":"($G$32+$H$32)/2","v":77.5},{"$f":"($H$32+$I$32)/2","v":82},{"$f":"($I$32+$J$32)/2","v":85.5},{"$f":"($J$32+$K$32)/2","v":90},{"$f":"($K$32+$L$32)/2","v":94.5},{"$f":"($L$32+$M$32)/2","v":97.5},{"$f":"($M$32+$N$32)/2","v":100},{"$f":"($N$32+$O$32)/2","v":102},{"$f":"($O$32+$P$32)/2","v":104},{"$f":"($P$32+$Q$32)/2","v":106.5},{"$f":"($Q$32+$R$32)/2","v":109},{"$f":"($R$32+$S$32)/2","v":111},{"$f":"($S$32+$T$32)/2","v":113},{"$f":"($T$32+$U$32)/2","v":114}]
["Z från slip surface"]
[0,0,{"$f":"OFFSET($J39,0,(COLUMN(B$1)-COLUMN($B$1))*5)","v":{"$error":"#NUM!"}},{"$f":"OFFSET($J39,0,(COLUMN(C$1)-COLUMN($B$1))*5)","v":{"$error":"#NUM!"}},{"$error":"#NUM!"},{"$error":"#NUM!"},{"$error":"#NUM!"},{"$error":"#NUM!"},{"$error":"#NUM!"},{"$error":"#NUM!"},{"$error":"#NUM!"},{"$error":"#DIV/0!"},{"$error":"#DIV/0!"},{"$error":"#DIV/0!"},{"$error":"#DIV/0!"},{"$error":"#DIV/0!"},{"$error":"#DIV/0!"},{"$error":"#DIV/0!"},{"$error":"#DIV/0!"},{"$error":"#DIV/0!"},{"$error":"#DIV/0!"},{"$error":"#DIV/0!"}]
[{"$f":"IF(A111<Height/3,A111+1,\"\")","v":""},0,{"$f":"OFFSET($J40,0,(COLUMN(B$1)-COLUMN($B$1))*5)","v":{"$error":"#VALUE!"}},{"$error":"#NUM!"},{"$error":"#NUM!"},{"$error":"#NUM!"},{"$error":"#NUM!"},{"$error":"#NUM!"},{"$error":"#NUM!"},{"$error":"#NUM!"},{"$error":"#NUM!"},{"$error":"#VALUE!"},{"$error":"#VALUE!"},{"$error":"#VALUE!"},{"$error":"#VALUE!"},{"$error":"#VALUE!"},{"$error":"#VALUE!"},{"$error":"#VALUE!"},{"$error":"#VALUE!"},{"$error":"#VALUE!"},{"$error":"#VALUE!"},{"$error":"#VALUE!"}]
["",0,{"$error":"#VALUE!"},{"$error":"#NUM!"},{"$error":"#NUM!"},{"$error":"#NUM!"},{"$error":"#NUM!"},{"$error":"#NUM!"},{"$error":"#NUM!"},{"$error":"#NUM!"},{"$error":"#NUM!"},{"$error":"#VALUE!"},{"$error":"#VALUE!"},{"$error":"#VALUE!"},{"$error":"#VALUE!"},{"$error":"#VALUE!"},{"$error":"#VALUE!"},{"$error":"#VALUE!"},{"$error":"#VALUE!"},{"$error":"#VALUE!"},{"$error":"#VALUE!"},{"$error":"#VALUE!"}]
["",0,{"$error":"#VALUE!"},{"$error":"#NUM!"},{"$error":"#NUM!"},{"$error":"#NUM!"},{"$error":"#NUM!"},{"$error":"#NUM!"},{"$error":"#NUM!"},{"$error":"#NUM!"},{"$error":"#NUM!"},{"$error":"#VALUE!"},{"$error":"#VALUE!"},{"$error":"#VALUE!"},{"$error":"#VALUE!"},{"$error":"#VALUE!"},{"$error":"#VALUE!"},{"$error":"#VALUE!"},{"$error":"#VALUE!"},{"$error":"#VALUE!"},{"$error":"#VALUE!"},{"$error":"#VALUE!"}]
["",0,{"$error":"#VALUE!"},{"$error":"#NUM!"},{"$error":"#NUM!"},{"$error":"#NUM!"},{"$error":"#NUM!"},{"$error":"#NUM!"},{"$error":"#NUM!"},{"$error":"#NUM!"},{"$error":"#NUM!"},{"$error":"#VALUE!"},{"$error":"#VALUE!"},{"$error":"#VALUE!"},{"$error":"#VALUE!"},{"$error":"#VALUE!"},{"$error":"#VALUE!"},{"$error":"#VALUE!"},{"$error":"#VALUE!"},{"$error":"#VALUE!"},{"$error":"#VALUE!"},{"$error":"#VALUE!"}]
["",0,{"$error":"#VALUE!"},{"$error":"#NUM!"},{"$error":"#NUM!"},{"$error":"#NUM!"},{"$error":"#NUM!"},{"$error":"#NUM!"},{"$error":"#NUM!"},{"$error":"#NUM!"},{"$error":"#NUM!"},{"$error":"#VALUE!"},{"$error":"#VALUE!"},{"$error":"#VALUE!"},{"$error":"#VALUE!"},{"$error":"#VALUE!"},{"$error":"#VALUE!"},{"$error":"#VALUE!"},{"$error":"#VALUE!"},{"$error":"#VALUE!"},{"$error":"#VALUE!"},{"$error":"#VALUE!"}]
["",0,{"$error":"#VALUE!"},{"$error":"#NUM!"},{"$error":"#NUM!"},{"$error":"#NUM!"},{"$error":"#NUM!"},{"$error":"#NUM!"},{"$error":"#NUM!"},{"$error":"#NUM!"},{"$error":"#NUM!"},{"$error":"#VALUE!"},{"$error":"#VALUE!"},{"$error":"#VALUE!"},{"$error":"#VALUE!"},{"$error":"#VALUE!"},{"$error":"#VALUE!"},{"$error":"#VALUE!"},{"$error":"#VALUE!"},{"$error":"#VALUE!"},{"$error":"#VALUE!"},{"$error":"#VALUE!"}]
["",0,{"$error":"#DIV/0!"},{"$error":"#NUM!"},{"$error":"#NUM!"},{"$error":"#NUM!"},{"$error":"#NUM!"},{"$error":"#NUM!"},{"$error":"#NUM!"},{"$error":"#NUM!"},{"$error":"#NUM!"},{"$error":"#DIV/0!"},{"$error":"#DIV/0!"},{"$error":"#DIV/0!"},{"$error":"#DIV/0!"},{"$error":"#DIV/0!"},{"$error":"#DIV/0!"},{"$error":"#DIV/0!"},{"$error":"#DIV/0!"},{"$error":"#DIV/0!"},{"$error":"#DIV/0!"},{"$error":"#DIV/0!"}]
[""]
[""]
["d (t)"]
[null,null,"Stage I",null,null,null,null,null,null,null,null,"Stage II"]
[null,"start value","Dx1","Dx2","Dx3","Dx4","Dx5","Dx6","Dx7","Dx8","Dx9","Dx10","Dx11","Dx12","Dx13","Dx14","Dx15","Dx16","Dx17","Dx18","Dx19","Dx20","SDx"]
["Distance from X=0",null,{"$f":"($B$32+$C$32)/2","v":18},{"$f":"($C$32+$D$32)/2","v":44.5},{"$f":"($D$32+$E$32)/2","v":58},{"$f":"($E$32+$F$32)/2","v":66.5},{"$f":"($F$32+$G$32)/2","v":72.5},{"$f":"($G$32+$H$32)/2","v":77.5},{"$f":"($H$32+$I$32)/2","v":82},{"$f":"($I$32+$J$32)/2","v":85.5},{"$f":"($J$32+$K$32)/2","v":90},{"$f":"($K$32+$L$32)/2","v":94.5},{"$f":"($L$32+$M$32)/2","v":97.5},{"$f":"($M$32+$N$32)/2","v":100},{"$f":"(N14+O14)/2","v":0},{"$f":"($O$32+$P$32)/2","v":104},{"$f":"($P$32+$Q$32)/2","v":106.5},{"$f":"($Q$32+$R$32)/2","v":109},{"$f":"($R$32+$S$32)/2","v":111},{"$f":"($S$32+$T$32)/2","v":113},{"$f":"($T$32+$U$32)/2","v":114}]
["Z från slip surface"]
[0,0,{"$f":"OFFSET($K39,0,(COLUMN(B$1)-COLUMN($B$1))*5)","v":0},0,0,0,0,0,0,0,0,0,0,0,0,0,0,0,0,0,0,0]
[{"$f":"IF(A126<Height/3,A126+1,\"\")","v":""},0,{"$error":"#VALUE!"},{"$error":"#VALUE!"},{"$error":"#VALUE!"},{"$error":"#VALUE!"},{"$error":"#VALUE!"},{"$error":"#VALUE!"},{"$error":"#VALUE!"},{"$error":"#VALUE!"},{"$error":"#VALUE!"},{"$error":"#VALUE!"},{"$error":"#VALUE!"},{"$error":"#VALUE!"},{"$error":"#VALUE!"},{"$error":"#VALUE!"},{"$error":"#VALUE!"},{"$error":"#VALUE!"},{"$error":"#VALUE!"},{"$error":"#VALUE!"},{"$error":"#VALUE!"},{"$error":"#VALUE!"}]
["",0,{"$error":"#VALUE!"},{"$error":"#VALUE!"},{"$error":"#VALUE!"},{"$error":"#VALUE!"},{"$error":"#VALUE!"},{"$error":"#VALUE!"},{"$error":"#VALUE!"},{"$error":"#VALUE!"},{"$error":"#VALUE!"},{"$error":"#VALUE!"},{"$error":"#VALUE!"},{"$error":"#VALUE!"},{"$error":"#VALUE!"},{"$error":"#VALUE!"},{"$error":"#VALUE!"},{"$error":"#VALUE!"},{"$error":"#VALUE!"},{"$error":"#VALUE!"},{"$error":"#VALUE!"},{"$error":"#VALUE!"}]
["",0,{"$error":"#VALUE!"},{"$error":"#VALUE!"},{"$error":"#VALUE!"},{"$error":"#VALUE!"},{"$error":"#VALUE!"},{"$error":"#VALUE!"},{"$error":"#VALUE!"},{"$error":"#VALUE!"},{"$error":"#VALUE!"},{"$error":"#VALUE!"},{"$error":"#VALUE!"},{"$error":"#VALUE!"},{"$error":"#VALUE!"},{"$error":"#VALUE!"},{"$error":"#VALUE!"},{"$error":"#VALUE!"},{"$error":"#VALUE!"},{"$error":"#VALUE!"},{"$error":"#VALUE!"},{"$error":"#VALUE!"}]
["",0,{"$error":"#VALUE!"},{"$error":"#VALUE!"},{"$error":"#VALUE!"},{"$error":"#VALUE!"},{"$error":"#VALUE!"},{"$error":"#VALUE!"},{"$error":"#VALUE!"},{"$error":"#VALUE!"},{"$error":"#VALUE!"},{"$error":"#VALUE!"},{"$error":"#VALUE!"},{"$error":"#VALUE!"},{"$error":"#VALUE!"},{"$error":"#VALUE!"},{"$error":"#VALUE!"},{"$error":"#VALUE!"},{"$error":"#VALUE!"},{"$error":"#VALUE!"},{"$error":"#VALUE!"},{"$error":"#VALUE!"}]
["",0,{"$error":"#VALUE!"},{"$error":"#VALUE!"},{"$error":"#VALUE!"},{"$error":"#VALUE!"},{"$error":"#VALUE!"},{"$error":"#VALUE!"},{"$error":"#VALUE!"},{"$error":"#VALUE!"},{"$error":"#VALUE!"},{"$error":"#VALUE!"},{"$error":"#VALUE!"},{"$error":"#VALUE!"},{"$error":"#VALUE!"},{"$error":"#VALUE!"},{"$error":"#VALUE!"},{"$error":"#VALUE!"},{"$error":"#VALUE!"},{"$error":"#VALUE!"},{"$error":"#VALUE!"},{"$error":"#VALUE!"}]
["",0,{"$error":"#VALUE!"},{"$error":"#VALUE!"},{"$error":"#VALUE!"},{"$error":"#VALUE!"},{"$error":"#VALUE!"},{"$error":"#VALUE!"},{"$error":"#VALUE!"},{"$error":"#VALUE!"},{"$error":"#VALUE!"},{"$error":"#VALUE!"},{"$error":"#VALUE!"},{"$error":"#VALUE!"},{"$error":"#VALUE!"},{"$error":"#VALUE!"},{"$error":"#VALUE!"},{"$error":"#VALUE!"},{"$error":"#VALUE!"},{"$error":"#VALUE!"},{"$error":"#VALUE!"},{"$error":"#VALUE!"}]
["",0,{"$error":"#VALUE!"},{"$error":"#VALUE!"},{"$error":"#VALUE!"},{"$error":"#VALUE!"},{"$error":"#VALUE!"},{"$error":"#VALUE!"},{"$error":"#VALUE!"},{"$error":"#VALUE!"},{"$error":"#VALUE!"},{"$error":"#VALUE!"},{"$error":"#VALUE!"},{"$error":"#VALUE!"},{"$error":"#VALUE!"},{"$error":"#VALUE!"},{"$error":"#VALUE!"},{"$error":"#VALUE!"},{"$error":"#VALUE!"},{"$error":"#VALUE!"},{"$error":"#VALUE!"},{"$error":"#VALUE!"}]
[]
[]
["Summary"]
[null,null,"Stage I",null,null,null,null,null,null,null,null,"Stage II"]
[null,"start value","Dx1","Dx2","Dx3","Dx4","Dx5","Dx6","Dx7","Dx8","Dx9","Dx10","Dx11","Dx12","Dx13","Dx14","Dx15","Dx16","Dx17","Dx18","Dx19","Dx20"]
["Distance from foot of slope where x=0",null,{"$f":"B32&\" (\"&ROUND($V$30,0)&\")\"","v":"0 (152)"},"36 (152)","53 (152)","63 (152)","70 (152)","75 (152)","80 (152)","84 (152)","87 (152)","93 (152)","96 (152)","99 (152)","101 (152)","103 (152)","105 (152)","108 (152)","110 (152)","112 (152)","114 (152)","114 (152)"]
[null,0,{"$f":"($B$32+$C$32)/2","v":18},{"$f":"($C$32+$D$32)/2","v":44.5},{"$f":"($D$32+$E$32)/2","v":58},{"$f":"($E$32+$F$32)/2","v":66.5},{"$f":"($F$32+$G$32)/2","v":72.5},{"$f":"($G$32+$H$32)/2","v":77.5},{"$f":"($H$32+$I$32)/2","v":82},{"$f":"($I$32+$J$32)/2","v":85.5},{"$f":"($J$32+$K$32)/2","v":90},{"$f":"($K$32+$L$32)/2","v":94.5},{"$f":"($L$32+$M$32)/2","v":97.5},{"$f":"($M$32+$N$32)/2","v":100},{"$f":"($N$32+$O$32)/2","v":102},{"$f":"($O$32+$P$32)/2","v":104},{"$f":"($P$32+$Q$32)/2","v":106.5},{"$f":"($Q$32+$R$32)/2","v":109},{"$f":"($R$32+$S$32)/2","v":111},{"$f":"($S$32+$T$32)/2","v":113},{"$f":"($T$32+$U$32)/2","v":114},{"$f":"($T$32+V30)/2","v":133.1018345332833}]
["D N",0,{"$f":"OFFSET($J50,0,(COLUMN(B$1)-COLUMN($B$1))*5)","v":{"$error":"#NUM!"}},{"$error":"#NUM!"},{"$error":"#NUM!"},{"$error":"#NUM!"},{"$error":"#NUM!"},{"$error":"#NUM!"},{"$error":"#NUM!"},{"$error":"#NUM!"},{"$error":"#NUM!"},0,0,0,0,0,0,0,0,0,0,0,"D N"]
["SD N",0,{"$error":"#NUM!"},{"$error":"#NUM!"},{"$error":"#NUM!"},{"$error":"#NUM!"},{"$error":"#NUM!"},{"$error":"#NUM!"},{"$error":"#NUM!"},{"$error":"#NUM!"},{"$error":"#NUM!"},{"$error":"#NUM!"},{"$error":"#NUM!"},{"$error":"#NUM!"},{"$error":"#NUM!"},{"$error":"#NUM!"},{"$error":"#NUM!"},{"$error":"#NUM!"},{"$error":"#NUM!"},{"$error":"#NUM!"},{"$error":"#NUM!"},{"$error":"#NUM!"},"SD N"]
[" d (N)",0,{"$error":"#NUM!"},{"$error":"#NUM!"},{"$error":"#NUM!"},{"$error":"#NUM!"},{"$error":"#NUM!"},{"$error":"#NUM!"},{"$error":"#NUM!"},{"$error":"#NUM!"},{"$error":"#NUM!"},{"$error":"#NUM!"},{"$error":"#NUM!"},{"$error":"#NUM!"},{"$error":"#NUM!"},{"$error":"#NUM!"},{"$error":"#NUM!"},{"$error":"#NUM!"},{"$error":"#NUM!"},{"$error":"#NUM!"},{"$error":"#NUM!"},{"$error":"#NUM!"}," d (N)"]
["S d (N)",0,{"$error":"#NUM!"},{"$error":"#NUM!"},{"$error":"#NUM!"},{"$error":"#NUM!"},{"$error":"#NUM!"},{"$error":"#NUM!"},{"$error":"#NUM!"},{"$error":"#NUM!"},{"$error":"#NUM!"},{"$error":"#NUM!"},{"$error":"#NUM!"},{"$error":"#NUM!"},{"$error":"#NUM!"},{"$error":"#NUM!"},{"$error":"#NUM!"},{"$error":"#NUM!"},{"$error":"#NUM!"},{"$error":"#NUM!"},{"$error":"#NUM!"},{"$error":"#NUM!"},"S d (N)"]
["S d (t)",0,{"$error":"#VALUE!"},{"$error":"#VALUE!"},{"$error":"#VALUE!"},{"$error":"#VALUE!"},{"$error":"#VALUE!"},{"$error":"#VALUE!"},{"$error":"#VALUE!"},{"$error":"#VALUE!"},{"$error":"#VALUE!"},{"$error":"#VALUE!"},{"$error":"#VALUE!"},{"$error":"#VALUE!"},{"$error":"#VALUE!"},{"$error":"#VALUE!"},{"$error":"#VALUE!"},{"$error":"#VALUE!"},{"$error":"#VALUE!"},{"$error":"#VALUE!"},{"$error":"#VALUE!"},{"$error":"#VALUE!"},"S d (t)"]
[{"$f":"IF(A145<Height/3,A145+1,\"\")","v":""}]
[]
[]
["End of Stage I","N",{"$f":"K142","v":{"$error":"#NUM!"}},"kN/m3"]
["End of stageI","x",{"$f":"K32","v":93},"m"]
["Critical Load","Ncrit [kN/m3]",{"$f":"MAX(C142:V142)","v":{"$error":"#NUM!"}},"kN/m3"]
["Critical lenght","Lcrit [m]",{"$f":"T32","v":114},"m"]
[null,"Linstab",{"$f":"U30","v":38.610033302034523},"m"]
[null,"q",{"$f":"C151/Height","v":{"$error":"#NUM!"}},"kN/m2"]
["Critical deformation","dcrit",{"$f":"$T$145","v":{"$error":"#VALUE!"}},"m"]
["Momentarily def","dinstab",{"$f":"$V$145","v":{"$error":"#VALUE!"}},"m"]

{"sheet":"Calculation template","index":3,"n_rows":156,"n_cols":106,"rows_kept":156,"cut":false,"hidden":true,"merged":[[2,4,2,5],[21,2,22,2],[35,1,35,4],[93,0,93,1]]}
[]
["Shear strength at surface","cs",16,"kN/m2"]
["Peak value for shear strength evaluated in lab","clab",28,"kN/m2","Factor for increasing shear strength peak  ",null,10,"%"]
["Peak value for shear strength","c",{"$f":"C3*(1+G3/100)","v":30.800000000000004},"kN/m2",null,null,null,null,null,null,null,null,null,null," "]
["Residual value for shear strength","cR",15,"kN/m2",{"$f":"IF(cR<=t0,\"Ok\",\"cR too high\")","v":"Ok"}]
["Shear stress at elastic limit","tel",16,"kN/m2",null,null,"t",0,{"$f":"tel","v":16},{"$f":"I6+($AB$6-$I$6)/19","v":16.778947368421054},{"$f":"J6+($AB$6-$I$6)/19","v":17.557894736842108},{"$f":"K6+($AB$6-$I$6)/19","v":18.336842105263162},19.115789473684217,19.894736842105271,20.673684210526325,21.452631578947379,22.231578947368433,23.010526315789487,23.789473684210542,24.568421052631596,25.34736842105265,26.126315789473704,26.905263157894758,27.684210526315812,28.463157894736867,29.242105263157921,30.021052631578975,{"$f":"c_peak","v":30.800000000000004},{"$f":"cR","v":15},{"$f":"AC6","v":15}]
["Deviator strain at elastic limit","gel",{"$f":"g_f*tel/(2*c_peak-tel)","v":1.0526315789473682E-2},null,null,null,"g",0,{"$f":"gel","v":1.0526315789473682E-2},{"$f":"g_f-(g_f-gel)*(1-(J6-tel)/(c_peak-tel))^0.5","v":1.1045707636300375E-2},1.1579738837738978E-2,1.212972178271414E-2,1.2697177518089672E-2,1.3283885376146724E-2,1.3891948895192154E-2,1.4523885091134758E-2,1.5182748063500407E-2,1.5872304603120835E-2,1.6597291337035615E-2,1.7363805090866932E-2,1.8179921994381745E-2,1.9056734201519172E-2,2.0010210782328786E-2,2.1064860891357097E-2,2.2261942545567407E-2,2.3681902545433502E-2,2.55324304456786E-2,{"$f":"g_f","v":0.03},{"$f":"def_cR","v":0.2},{"$f":"def_cR+0.05","v":0.25}]
["Deviator strain at failure limit","gf",0.03,null,null,null,"t0",{"$f":"t0","v":22.345320863972443},22.345320863972443,22.345320863972443,22.345320863972443,22.345320863972443,22.345320863972443,22.345320863972443,22.345320863972443,22.345320863972443,22.345320863972443,22.345320863972443,22.345320863972443,22.345320863972443,22.345320863972443,22.345320863972443,22.345320863972443,22.345320863972443,22.345320863972443,22.345320863972443,22.345320863972443,22.345320863972443,22.345320863972443,22.345320863972443]
["Elastic modulus at shear","G",{"$f":"tel/gel","v":1520.0000000000002},null,null,null,null,null,null,null,null,null,null,null,null,null,null,null,null,null,null,null,null,null,null,null,null,{"$f":"F9","v":0}]
["Elastic modulus","Emean",{"$f":"G/c_peak*2*(1+0.5)*(cS+c_peak)/2","v":3464.4155844155844}]
["Post peak slip at z=0 when cR is reached","dcR",0.2,"m"]
["Density:","dstart",16]
[null,"dgain",0]
["Depth to slip surface","H",20,"m"]
["Gradient","dy/dx",7.0000000000000007E-2]
["Sensitivity ratio","cR/cu",{"$f":"cR/c_peak","v":0.48701298701298695}]
[]
["Colour indication:"]
["Cells that require input"]
["to<tel"]
["to>tel"]
["t+Dt<tel",null,"  Stage I"]
["tel<t+Dt<cu"]
["cu<t+Dt<cR",null,"Stage IIa"]
["t+Dt=cR",null,"Stage IIb"]
[null,null,null,null,null,null,null,null,null,null,"c",null,null,null,null,null,null,null,"to","cR"]
[]
[null,"Stage I",null,null,null,null,null,null,null,null,"Stage II"]
[null,"Dx1","Dx2","Dx3","Dx4","Dx5","Dx6","Dx7","Dx8","Dx9","Dx10","Dx11","Dx12","Dx13","Dx14","Dx15","Dx16","Dx17","Dx18","Dx19","Dx20","SDx"]
["length of Dx",36.385826059010505,17.041257051505603,9.5132360995152361,6.7452629987239696,5.3397221812728493,4.5215485620236722,4.0223895573480908,3.7500187400899088,6.0749793369883278,2.8019464525139419,2.5244141873137331,2.3546199179529212,2.2343502861473765,2.147346697921872,2.0843036691296248,2.0397716123174328,2.0132189400091605,1.9994234147459702,1.8491037887086547E-12,38.610033302034523,{"$f":"SUM(Dx)","v":152.20366906656659}]
["Dt",{"$f":"0.5+((COLUMN(A1)-COLUMN($A$1))^grad)*((c_peak-$B$39)/10)","v":0.5},{"$f":"((COLUMN(B1)-COLUMN($A$1))^grad)*((c_peak-$B$39)/10)","v":0.84546791360275608},0.88750177437679911,0.91305222291871213,0.93162541930840115,0.946291699435723,0.95844615141690004,0.9688443102449743,{"$f":"E39-0.001-AR39","v":1.5024496447232956},{"$f":"IF(t0>cR,-(c_peak-t0)/9,-(c_peak-cR)/9)","v":-0.93940879289195123},-0.93940879289195123,-0.93940879289195123,-0.93940879289195123,-0.93940879289195123,-0.93940879289195123,-0.93940879289195123,-0.93940879289195123,-0.93940879289195123,{"$f":"cR-CP39","v":-7.3453208639724572},0]
["Start (length from x=0)",0,{"$f":"ROUND(SUM($B$30:B30),0)","v":36},{"$f":"ROUND(SUM($B$30:C30),0)","v":53},{"$f":"ROUND(SUM($B$30:D30),0)","v":63},{"$f":"ROUND(SUM($B$30:E30),0)","v":70},{"$f":"ROUND(SUM($B$30:F30),0)","v":75},{"$f":"ROUND(SUM($B$30:G30),0)","v":80},{"$f":"ROUND(SUM($B$30:H30),0)","v":84},{"$f":"ROUND(SUM($B$30:I30),0)","v":87},{"$f":"ROUND(SUM($B$30:J30),0)","v":93},{"$f":"ROUND(SUM($B$30:K30),0)","v":96},{"$f":"ROUND(SUM($B$30:L30),0)","v":99},{"$f":"ROUND(SUM($B$30:M30),0)","v":101},{"$f":"ROUND(SUM($B$30:N30),0)","v":103},{"$f":"ROUND(SUM($B$30:O30),0)","v":105},{"$f":"ROUND(SUM($B$30:P30),0)","v":108},{"$f":"ROUND(SUM($B$30:Q30),0)","v":110},{"$f":"ROUND(SUM($B$30:R30),0)","v":112},{"$f":"ROUND(SUM($B$30:S30),0)","v":114},{"$f":"ROUND(SUM($B$30:T30),0)","v":114}]
[]
[]
[null,null,null,null,null,null,"STAGE I",null,null,null,null,null,null,null,null,null,null,null,null,null,null,null,null,null,null,null,null,null,null,null,null,null,null,null,null,null,null,null,null,null,null,null,null,null,null,null,null,null,null,null,null,"STAGE II"]
[null,"In situ",null,null,null,"Stage II",null,"x",1,null,{"$f":"OFFSET($B$30,0,(COLUMN(B1)-COLUMN($B$1))/5)","v":36.385826059010505},null,"x",{"$f":"I36+1","v":2},null,{"$f":"OFFSET($B$30,0,(COLUMN(G1)-COLUMN($B$1))/5)","v":17.041257051505603},null,"x",{"$f":"N36+1","v":3},null,{"$f":"OFFSET($B$30,0,(COLUMN(L1)-COLUMN($B$1))/5)","v":9.5132360995152361},null,"x",{"$f":"S36+1","v":4},null,{"$f":"OFFSET($B$30,0,(COLUMN(Q1)-COLUMN($B$1))/5)","v":6.7452629987239696},null,"x",{"$f":"X36+1","v":5},null,{"$f":"OFFSET($B$30,0,(COLUMN(V1)-COLUMN($B$1))/5)","v":5.3397221812728493},null,"x",{"$f":"AC36+1","v":6},null,{"$f":"OFFSET($B$30,0,(COLUMN(AA1)-COLUMN($B$1))/5)","v":4.5215485620236722},null,"x",{"$f":"AH36+1","v":7},null,{"$f":"OFFSET($B$30,0,(COLUMN(AF1)-COLUMN($B$1))/5)","v":4.0223895573480908},null,"x",{"$f":"AM36+1","v":8},null,{"$f":"OFFSET($B$30,0,(COLUMN(AK1)-COLUMN($B$1))/5)","v":3.7500187400899088},null,"x",{"$f":"AR36+1","v":9},null,{"$f":"OFFSET($B$30,0,(COLUMN(AP1)-COLUMN($B$1))/5)","v":6.0749793369883278},null,"x",{"$f":"AW36+1","v":10},null,{"$f":"OFFSET($B$30,0,(COLUMN(AU1)-COLUMN($B$1))/5)","v":2.8019464525139419},null,"x",{"$f":"BB36+1","v":11},null,{"$f":"OFFSET($B$30,0,(COLUMN(AZ1)-COLUMN($B$1))/5)","v":2.5244141873137331},null,"x",{"$f":"BG36+1","v":12},null,{"$f":"OFFSET($B$30,0,(COLUMN(BE1)-COLUMN($B$1))/5)","v":2.3546199179529212},null,"x",{"$f":"BL36+1","v":13},null,{"$f":"OFFSET($B$30,0,(COLUMN(BJ1)-COLUMN($B$1))/5)","v":2.2343502861473765},null,"x",{"$f":"BQ36+1","v":14},null,{"$f":"OFFSET($B$30,0,(COLUMN(BO1)-COLUMN($B$1))/5)","v":2.147346697921872},null,"x",{"$f":"BV36+1","v":15},null,{"$f":"OFFSET($B$30,0,(COLUMN(BT1)-COLUMN($B$1))/5)","v":2.0843036691296248},null,"x",{"$f":"CA36+1","v":16},null,{"$f":"OFFSET($B$30,0,(COLUMN(BY1)-COLUMN($B$1))/5)","v":2.0397716123174328},null,"x",{"$f":"CF36+1","v":17},null,{"$f":"OFFSET($B$30,0,(COLUMN(CD1)-COLUMN($B$1))/5)","v":2.0132189400091605},null,"x",{"$f":"CK36+1","v":18},null,{"$f":"OFFSET($B$30,0,(COLUMN(CI1)-COLUMN($B$1))/5)","v":1.9994234147459702},null,"x",{"$f":"CP36+1","v":19},null,{"$f":"OFFSET($B$30,0,(COLUMN(CN1)-COLUMN($B$1))/5)","v":1.8491037887086547E-12},null,"x",{"$f":"CU36+1","v":20},null,{"$f":"OFFSET($B$30,0,(COLUMN(CS1)-COLUMN($B$1))/5)","v":38.610033302034523}]
["start of Dx(Sx)",null,null,null,null,null,null,null,null,null,{"$f":"OFFSET($B$32,0,(COLUMN(B1)-COLUMN($B$1))*5)&\" (\"&ROUND($V$30,0)&\")\"","v":"0 (152)"},null,null,null,null,{"$f":"OFFSET($B$32,0,(COLUMN(G1)-COLUMN($B$1))/5)&\" (\"&ROUND($V$30,0)&\")\"","v":"36 (152)"},null,null,null,null,{"$f":"OFFSET($B$32,0,(COLUMN(L1)-COLUMN($B$1))/5)&\" (\"&ROUND($V$30,0)&\")\"","v":"53 (152)"},null,null,null,null,{"$f":"OFFSET($B$32,0,(COLUMN(Q1)-COLUMN($B$1))/5)&\" (\"&ROUND($V$30,0)&\")\"","v":"63 (152)"},null,null,null,null,{"$f":"OFFSET($B$32,0,(COLUMN(V1)-COLUMN($B$1))/5)&\" (\"&ROUND($V$30,0)&\")\"","v":"70 (152)"},null,null,null,null,{"$f":"OFFSET($B$32,0,(COLUMN(AA1)-COLUMN($B$1))/5)&\" (\"&ROUND($V$30,0)&\")\"","v":"75 (152)"},null,null,null,null,{"$f":"OFFSET($B$32,0,(COLUMN(AF1)-COLUMN($B$1))/5)&\" (\"&ROUND($V$30,0)&\")\"","v":"80 (152)"},null,null,null,null,{"$f":"OFFSET($B$32,0,(COLUMN(AK1)-COLUMN($B$1))/5)&\" (\"&ROUND($V$30,0)&\")\"","v":"84 (152)"},null,null,null,null,{"$f":"OFFSET($B$32,0,(COLUMN(AP1)-COLUMN($B$1))/5)&\" (\"&ROUND($V$30,0)&\")\"","v":"87 (152)"},null,null,null,null,{"$f":"OFFSET($B$32,0,(COLUMN(AU1)-COLUMN($B$1))/5)&\" (\"&ROUND($V$30,0)&\")\"","v":"93 (152)"},null,null,null,null,{"$f":"OFFSET($B$32,0,(COLUMN(AZ1)-COLUMN($B$1))/5)&\" (\"&ROUND($V$30,0)&\")\"","v":"96 (152)"},null,null,null,null,{"$f":"OFFSET($B$32,0,(COLUMN(BE1)-COLUMN($B$1))/5)&\" (\"&ROUND($V$30,0)&\")\"","v":"99 (152)"},null,null,null,null,{"$f":"OFFSET($B$32,0,(COLUMN(BJ1)-COLUMN($B$1))/5)&\" (\"&ROUND($V$30,0)&\")\"","v":"101 (152)"},null,null,null,null,{"$f":"OFFSET($B$32,0,(COLUMN(BO1)-COLUMN($B$1))/5)&\" (\"&ROUND($V$30,0)&\")\"","v":"103 (152)"},null,null,null,null,{"$f":"OFFSET($B$32,0,(COLUMN(BT1)-COLUMN($B$1))/5)&\" (\"&ROUND($V$30,0)&\")\"","v":"105 (152)"},null,null,null,null,{"$f":"OFFSET($B$32,0,(COLUMN(BY1)-COLUMN($B$1))/5)&\" (\"&ROUND($V$30,0)&\")\"","v":"108 (152)"},null,null,null,null,{"$f":"OFFSET($B$32,0,(COLUMN(CD1)-COLUMN($B$1))/5)&\" (\"&ROUND($V$30,0)&\")\"","v":"110 (152)"},null,null,null,null,{"$f":"OFFSET($B$32,0,(COLUMN(CI1)-COLUMN($B$1))/5)&\" (\"&ROUND($V$30,0)&\")\"","v":"112 (152)"},null,null,null,null,{"$f":"OFFSET($B$32,0,(COLUMN(CN1)-COLUMN($B$1))/5)&\" (\"&ROUND($V$30,0)&\")\"","v":"114 (152)"},null,null,null,null,{"$f":"OFFSET($B$32,0,(COLUMN(CS1)-COLUMN($B$1))/5)&\" (\"&ROUND($V$30,0)&\")\"","v":"114 (152)"}]
["Z från slip surface","to","Density","tel","cu","tmax","t","Dt","t+Dt","g(t)","d (t)","t","Dt","t+Dt","g(t)","d (t)","t","Dt","t+Dt","g(t)","d (t)","t","Dt","t+Dt","g(t)","d (t)","t","Dt","t+Dt","g(t)","d (t)","t","Dt","t+Dt","g(t)","d (t)","t","Dt","t+Dt","g(t)","d (t)","t","Dt","t+Dt","g(t)","d (t)","t","Dt","t+Dt","g(t)","d (t)","t","Dt","t+Dt","g(t)","d (t)","t","Dt","t+Dt","g(t)","d (t)","t","Dt","t+Dt","g(t)","d (t)","t","Dt","t+Dt","g(t)","d (t)","t","Dt","t+Dt","g(t)","d (t)","t","Dt","t+Dt","g(t)","d (t)","t","Dt","t+Dt","g(t)","d (t)","t","Dt","t+Dt","g(t)","d (t)","t","Dt","t+Dt","g(t)","d (t)","t","Dt","t+Dt","g(t)","d (t)","t","Dt","t+Dt","g(t)","d (t)"]
[0,{"$f":"Density*Height*SIN(ATAN(grad))","v":22.345320863972443},{"$f":"$C$12+$C$13*(Height-z)","v":16},{"$f":"tel*cu/c_peak","v":16},{"$f":"c_peak-(c_peak-cS)*z/Height","v":30.800000000000004},{"$f":"c_peak","v":30.800000000000004},{"$f":"to","v":22.345320863972443},{"$f":"B31","v":0.5},{"$f":"t+dt_z","v":22.845320863972443},{"$f":"IF(I39<t_el,(I39-t)*gel/t_el,(IF(to>t_el,(g_f-gel)*(SQRT(1-(to-t_el)/(cu-t_el))-SQRT(1-(I39-t_el)/(cu-t_el))),(t_el-to)*gel/t_el+(g_f-gel)*(1-SQRT(ABS(1-(I39-t_el)/(cu-t_el)))))))","v":4.4185206930851971E-4},0,{"$f":"t_Dt","v":22.845320863972443},{"$f":"C31","v":0.84546791360275608},{"$f":"L39+M39","v":23.6907887775752},{"$f":"IF(N39<t_el,(N39-t)*gel/t_el,(IF(to>t_el,(g_f-gel)*(SQRT(1-(to-t_el)/(cu-t_el))-SQRT(1-(N39-t_el)/(cu-t_el))),(t_el-to)*gel/t_el+(g_f-gel)*(1-SQRT(ABS(1-(N39-t_el)/(cu-t_el)))))))","v":1.2218654168959725E-3},0,{"$f":"N39","v":23.6907887775752},{"$f":"D31","v":0.88750177437679911},{"$f":"Q39+R39","v":24.578290551951998},{"$f":"IF(S39<t_el,(S39-t)*gel/t_el,(IF(to>t_el,(g_f-gel)*(SQRT(1-(to-t_el)/(cu-t_el))-SQRT(1-(S39-t_el)/(cu-t_el))),(t_el-to)*gel/t_el+(g_f-gel)*(1-SQRT(ABS(1-(S39-t_el)/(cu-t_el)))))))","v":2.0923927981755163E-3},0,{"$f":"S39","v":24.578290551951998},{"$f":"E31","v":0.91305222291871213},{"$f":"V39+W39","v":25.491342774870709},{"$f":"IF(X39<t_el,(X39-t)*gel/t_el,(IF(to>t_el,(g_f-gel)*(SQRT(1-(to-t_el)/(cu-t_el))-SQRT(1-(X39-t_el)/(cu-t_el))),(t_el-to)*gel/t_el+(g_f-gel)*(1-SQRT(ABS(1-(X39-t_el)/(cu-t_el)))))))","v":3.055595156964813E-3},0,{"$f":"X39","v":25.491342774870709},{"$f":"F31","v":0.93162541930840115},{"$f":"AA39+AB39","v":26.422968194179109},{"$f":"IF(AC39<t_el,(AC39-t)*gel/t_el,(IF(to>t_el,(g_f-gel)*(SQRT(1-(to-t_el)/(cu-t_el))-SQRT(1-(AC39-t_el)/(cu-t_el))),(t_el-to)*gel/t_el+(g_f-gel)*(1-SQRT(ABS(1-(AC39-t_el)/(cu-t_el)))))))","v":4.128305167363705E-3},0,{"$f":"AC39","v":26.422968194179109},{"$f":"G31","v":0.946291699435723},{"$f":"AF39+AG39","v":27.369259893614831},{"$f":"IF(AH39<t_el,(AH39-t)*gel/t_el,(IF(to>t_el,(g_f-gel)*(SQRT(1-(to-t_el)/(cu-t_el))-SQRT(1-(AH39-t_el)/(cu-t_el))),(t_el-to)*gel/t_el+(g_f-gel)*(1-SQRT(ABS(1-(AH39-t_el)/(cu-t_el)))))))","v":5.3427158911762427E-3},0,{"$f":"AH39","v":27.369259893614831},{"$f":"H31","v":0.95844615141690004},{"$f":"AK39+AL39","v":28.327706045031732},{"$f":"IF(AM39<t_el,(AM39-t)*gel/t_el,(IF(to>t_el,(g_f-gel)*(SQRT(1-(to-t_el)/(cu-t_el))-SQRT(1-(AM39-t_el)/(cu-t_el))),(t_el-to)*gel/t_el+(g_f-gel)*(1-SQRT(ABS(1-(AM39-t_el)/(cu-t_el)))))))","v":6.7594156828066927E-3},0,{"$f":"AM39","v":28.327706045031732},{"$f":"I31","v":0.9688443102449743},{"$f":"AP39+AQ39","v":29.296550355276707},{"$f":"IF(AR39<t_el,(AR39-t)*gel/t_el,(IF(to>t_el,(g_f-gel)*(SQRT(1-(to-t_el)/(cu-t_el))-SQRT(1-(AR39-t_el)/(cu-t_el))),(t_el-to)*gel/t_el+(g_f-gel)*(1-SQRT(ABS(1-(AR39-t_el)/(cu-t_el)))))))","v":8.5118635748795569E-3},0,{"$f":"AR39","v":29.296550355276707},{"$f":"J31","v":1.5024496447232956},{"$f":"AU39+AV39","v":30.799000000000003},{"$f":"IF(AW39<t_el,(AW39-t)*gel/t_el,(IF(to>t_el,(g_f-gel)*(SQRT(1-(to-t_el)/(cu-t_el))-SQRT(1-(AW39-t_el)/(cu-t_el))),(t_el-to)*gel/t_el+(g_f-gel)*(1-SQRT(ABS(1-(AW39-t_el)/(cu-t_el)))))))","v":1.455850451766327E-2},0,{"$f":"c_peak","v":30.800000000000004},{"$f":"K31","v":-0.93940879289195123},{"$f":"AZ39+BA39","v":29.860591207108055},{"$f":"IF(to>t_el,(g_f-gel)*(SQRT(1-(to-t_el)/(cu-t_el))-SQRT(1-(ABS(tmax-t_el))/(cu-t_el)))-(tmax-BB39)*gel/t_el,(t_el-to)*gel/t_el+(g_f-gel)*(1-SQRT(1-(ABS(tmax-t_el))/(cu-t_el)))+(BB39-tmax)*gel/t_el)","v":1.4100545115242303E-2},0,{"$f":"BB39","v":29.860591207108055},{"$f":"L31","v":-0.93940879289195123},{"$f":"BE39+BF39","v":28.921182414216105},{"$f":"IF(to>t_el,(g_f-gel)*(SQRT(1-(to-t_el)/(cu-t_el))-SQRT(1-(ABS(tmax-t_el))/(cu-t_el)))-(tmax-BG39)*gel/t_el,(t_el-to)*gel/t_el+(g_f-gel)*(1-SQRT(1-(ABS(tmax-t_el))/(cu-t_el)))+(BG39-tmax)*gel/t_el)","v":1.3482513014655494E-2},0,{"$f":"BG39","v":28.921182414216105},{"$f":"M31","v":-0.93940879289195123},{"$f":"BJ39+BK39","v":27.981773621324155},{"$f":"IF(to>t_el,(g_f-gel)*(SQRT(1-(to-t_el)/(cu-t_el))-SQRT(1-(ABS(tmax-t_el))/(cu-t_el)))-(tmax-BL39)*gel/t_el,(t_el-to)*gel/t_el+(g_f-gel)*(1-SQRT(1-(ABS(tmax-t_el))/(cu-t_el)))+(BL39-tmax)*gel/t_el)","v":1.2864480914068685E-2},0,{"$f":"BL39","v":27.981773621324155},{"$f":"N31","v":-0.93940879289195123},{"$f":"BO39+BP39","v":27.042364828432206},{"$f":"IF(to>t_el,(g_f-gel)*(SQRT(1-(to-t_el)/(cu-t_el))-SQRT(1-(ABS(tmax-t_el))/(cu-t_el)))-(tmax-BQ39)*gel/t_el,(t_el-to)*gel/t_el+(g_f-gel)*(1-SQRT(1-(ABS(tmax-t_el))/(cu-t_el)))+(BQ39-tmax)*gel/t_el)","v":1.2246448813481876E-2},0,{"$f":"BQ39","v":27.042364828432206},{"$f":"O31","v":-0.93940879289195123},{"$f":"BT39+BU39","v":26.102956035540256},{"$f":"IF(to>t_el,(g_f-gel)*(SQRT(1-(ABS(to-t_el))/(cu-t_el))-SQRT(1-(ABS(tmax-t_el))/(cu-t_el)))-(tmax-BV39)*gel/t_el,(t_el-to)*gel/t_el+(g_f-gel)*(1-SQRT(1-(ABS(tmax-t_el))/(cu-t_el)))+(BV39-tmax)*gel/t_el)","v":1.1628416712895067E-2},0,{"$f":"BV39","v":26.102956035540256},{"$f":"P31","v":-0.93940879289195123},{"$f":"BY39+BZ39","v":25.163547242648306},{"$f":"IF(to>t_el,(g_f-gel)*(SQRT(1-(ABS(to-t_el))/(cu-t_el))-SQRT(1-(ABS(tmax-t_el))/(cu-t_el)))-(tmax-CA39)*gel/t_el,(t_el-to)*gel/t_el+(g_f-gel)*(1-SQRT(1-(ABS(tmax-t_el))/(cu-t_el)))+(CA39-tmax)*gel/t_el)","v":1.1010384612308258E-2},0,{"$f":"CA39","v":25.163547242648306},{"$f":"Q31","v":-0.93940879289195123},{"$f":"CD39+CE39","v":24.224138449756357},{"$f":"IF(to>t_el,(g_f-gel)*(SQRT(1-(ABS(to-t_el))/(cu-t_el))-SQRT(1-(ABS(tmax-t_el))/(cu-t_el)))-(tmax-CF39)*gel/t_el,(t_el-to)*gel/t_el+(g_f-gel)*(1-SQRT(1-(ABS(tmax-t_el))/(cu-t_el)))+(CF39-tmax)*gel/t_el)","v":1.039235251172145E-2},0,{"$f":"CF39","v":24.224138449756357},{"$f":"R31","v":-0.93940879289195123},{"$f":"CI39+CJ39","v":23.284729656864407},{"$f":"IF(to>t_el,(g_f-gel)*(SQRT(1-(ABS(to-t_el))/(cu-t_el))-SQRT(1-(ABS(tmax-t_el))/(cu-t_el)))-(tmax-CK39)*gel/t_el,(t_el-to)*gel/t_el+(g_f-gel)*(1-SQRT(1-(ABS(tmax-t_el))/(cu-t_el)))+(CK39-tmax)*gel/t_el)","v":9.7743204111346398E-3},0,{"$f":"CK39","v":23.284729656864407},{"$f":"S31","v":-0.93940879289195123},{"$f":"CN39+CO39","v":22.345320863972457},{"$f":"IF(to>t_el,(g_f-gel)*(SQRT(1-(ABS(to-t_el))/(cu-t_el))-SQRT(1-(ABS(tmax-t_el))/(cu-t_el)))-(tmax-CP39)*gel/t_el,(t_el-to)*gel/t_el+(g_f-gel)*(1-SQRT(1-(ABS(tmax-t_el))/(cu-t_el)))+(CP39-tmax)*gel/t_el)","v":9.1562883105478325E-3},0,{"$f":"CP39","v":22.345320863972457},{"$f":"T31","v":-7.3453208639724572},{"$f":"CS39+CT39","v":15},{"$f":"IF(to>t_el,(g_f-gel)*(SQRT(1-(ABS(to-t_el))/(cu-t_el))-SQRT(1-(ABS(tmax-t_el))/(cu-t_el)))-(tmax-CU39)*gel/t_el,(t_el-to)*gel/t_el+(g_f-gel)*(1-SQRT(1-(ABS(tmax-t_el))/(cu-t_el)))+(CU39-tmax)*gel/t_el)","v":4.3238403737238477E-3},0,{"$f":"CU39","v":15},{"$f":"U31","v":0},{"$f":"CX39+CY39","v":15},{"$f":"IF(to>t_el,(g_f-gel)*(SQRT(1-(ABS(to-t_el))/(cu-t_el))-SQRT(1-(ABS(tmax-t_el))/(cu-t_el)))-(tmax-CZ39)*gel/t_el,(t_el-to)*gel/t_el+(g_f-gel)*(1-SQRT(1-(ABS(tmax-t_el))/(cu-t_el)))+(CZ39-tmax)*gel/t_el)","v":4.3238403737238477E-3},0]
[{"$f":"IF(A39<Height/3,A39+1,\"\")","v":1},{"$f":"$B$39*(1-(z-$A$39)/Height)","v":21.228054820773821},16,15.615584415584415,30.060000000000002,{"$f":"$F$39*(1-(z-$A$39)/Height)","v":29.26},{"$f":"$G$39*(1-(z-$A$39)/Height)","v":21.228054820773821},{"$f":"$H$39*(1-(z-$A$39)/Height)","v":0.47499999999999998},21.703054820773822,4.1513972602361446E-4,{"$f":"(z-$A39)*AVERAGE(J39:J40)","v":4.2849589766606711E-4},{"$f":"L$39*(1-(z-$A$39)/Height)","v":21.703054820773819},0.8031945179226182,22.506249338696438,1.1449294805041029E-3,{"$f":"(z-$A39)*AVERAGE(O39:O40)","v":1.1833974487000377E-3},{"$f":"Q$39*(1-(z-$A$39)/Height)","v":22.506249338696438},0.84312668565795912,{"$f":"Q40+R40","v":23.349376024354399},1.9540989965284561E-3,{"$f":"(z-$A39)*AVERAGE(T39:T40)","v":2.023245897351986E-3},{"$f":"V$39*(1-(z-$A$39)/Height)","v":23.349376024354395},0.86739961177277647,24.216775636127171,2.8416096073977343E-3,{"$f":"(z-$A39)*AVERAGE(Y39:Y40)","v":2.9486023821812734E-3},{"$f":"AA$39*(1-(z-$A$39)/Height)","v":24.216775636127174},0.88504414834298106,{"$f":"AA40+AB40","v":25.101819784470155},3.8181120831347532E-3,{"$f":"(z-$A39)*AVERAGE(AD39:AD40)","v":3.9732086252492289E-3},{"$f":"AF$39*(1-(z-$A$39)/Height)","v":25.101819784470152},0.8989771144639368,26.000796898934087,4.9041202185507102E-3,{"$f":"(z-$A39)*AVERAGE(AI39:AI40)","v":5.123418054863476E-3},{"$f":"AK$39*(1-(z-$A$39)/Height)","v":26.000796898934087},0.910523843846055,{"$f":"AK40+AL40","v":26.911320742780141},6.1353585648452726E-3,{"$f":"(z-$A39)*AVERAGE(AN39:AN40)","v":6.4473871238259831E-3},{"$f":"AP$39*(1-(z-$A$39)/Height)","v":26.911320742780145},0.9204020947327255,27.831722837512871,7.5788057657613381E-3,{"$f":"(z-$A39)*AVERAGE(AS39:AS40)","v":8.0453346703204479E-3},{"$f":"AU$39*(1-(z-$A$39)/Height)","v":27.831722837512871},1.4273271624871307,{"$f":"AU40+AV40","v":29.259050000000002},1.0641770390435536E-2,{"$f":"(z-$A39)*AVERAGE(AX39:AX40)","v":1.2600137454049403E-2},{"$f":"AZ$39*(1-(z-$A$39)/Height)","v":29.26},-0.89243835324735366,{"$f":"AZ40+BA40","v":28.367561646752648},1.0042906556686168E-2,{"$f":"(z-$A39)*AVERAGE(BC39:BC40)","v":1.2071725835964235E-2},{"$f":"BE$39*(1-(z-$A$39)/Height)","v":28.367561646752652},-0.89243835324735366,27.475123293505298,9.4413224161948184E-3,{"$f":"(z-$A39)*AVERAGE(BH39:BH40)","v":1.1461917715425155E-2},{"$f":"BJ$39*(1-(z-$A$39)/Height)","v":27.475123293505298},-0.89243835324735366,{"$f":"BJ40+BK40","v":26.582684940257945},8.839738275703465E-3,{"$f":"(z-$A39)*AVERAGE(BM39:BM40)","v":1.0852109594886075E-2},{"$f":"BO$39*(1-(z-$A$39)/Height)","v":26.582684940257945},-0.89243835324735366,25.690246587010591,8.2381541352121133E-3,{"$f":"(z-$A39)*AVERAGE(BR39:BR40)","v":1.0242301474346995E-2},{"$f":"BT$39*(1-(z-$A$39)/Height)","v":25.690246587010595},-0.89243835324735366,{"$f":"BT40+BU40","v":24.797808233763242},7.6365699947207625E-3,{"$f":"(z-$A39)*AVERAGE(BW39:BW40)","v":9.6324933538079142E-3},{"$f":"BY$39*(1-(z-$A$39)/Height)","v":24.797808233763242},-0.89243835324735366,23.905369880515888,7.03498585422941E-3,{"$f":"(z-$A39)*AVERAGE(CB39:CB40)","v":9.0226852332688338E-3},{"$f":"CD$39*(1-(z-$A$39)/Height)","v":23.905369880515888},-0.89243835324735366,{"$f":"CD40+CE40","v":23.012931527268535},6.4334017137380574E-3,{"$f":"(z-$A39)*AVERAGE(CG39:CG40)","v":8.4128771127297535E-3},{"$f":"CI$39*(1-(z-$A$39)/Height)","v":23.012931527268538},-0.89243835324735366,22.120493174021185,5.8318175732467083E-3,{"$f":"(z-$A39)*AVERAGE(CL39:CL40)","v":7.803068992190674E-3},{"$f":"CN$39*(1-(z-$A$39)/Height)","v":22.120493174021185},-0.89243835324735366,{"$f":"CN40+CO40","v":21.228054820773831},5.2302334327553558E-3,{"$f":"(z-$A39)*AVERAGE(CQ39:CQ40)","v":7.1932608716515946E-3},{"$f":"CS$39*(1-(z-$A$39)/Height)","v":21.228054820773835},-6.978054820773834,{"$f":"CS40+CT40","v":14.25},5.2639355812229838E-4,{"$f":"(z-$A39)*AVERAGE(CV39:CV40)","v":2.425116965923073E-3},{"$f":"CX$39*(1-(z-$A$39)/Height)","v":14.25},0,{"$f":"CX40+CY40","v":14.25},5.2639355812229838E-4,{"$f":"(z-$A39)*AVERAGE(DA39:DA40)","v":2.425116965923073E-3}]
[2,20.110788777575198,16,15.231168831168832,29.320000000000004,27.720000000000006,20.110788777575198,0.45,20.560788777575198,3.8948186284183689E-4,4.0231079443272567E-4,20.560788777575198,0.76092112224248054,21.321709899817677,1.0715734142900282E-3,1.1082514473970656E-3,21.32170989981768,0.79875159693911923,22.1204614967568,1.823484901140151E-3,1.8887919488343036E-3,22.1204614967568,0.82174700062684092,22.942208497383639,2.6419981520867056E-3,2.7418038797422202E-3,22.942208497383639,0.83846287737756109,23.780671374761202,3.5335837727347203E-3,3.6758479279347367E-3,23.780671374761198,0.85166252949215071,24.63233390425335,4.511421124174189E-3,4.70777067136245E-3,24.63233390425335,0.86260153627521008,25.494935440528561,5.5974240502982085E-3,5.866391307571741E-3,25.494935440528561,0.87195987922047691,26.366895319749037,6.8286562175020969E-3,7.2037309916317179E-3,26.366895319749037,1.352204680250966,27.719100000000005,9.1798803385871718E-3,9.9108253645113532E-3,27.720000000000006,-0.84546791360275608,26.874532086397249,8.5974198591650345E-3,9.3201632079256014E-3,26.874532086397249,-0.84546791360275608,26.029064172794492,8.013113930506563E-3,8.7272181733506898E-3,26.029064172794495,-0.84546791360275608,25.183596259191738,7.4288080018480931E-3,8.13427313877578E-3,25.183596259191741,-0.84546791360275608,24.338128345588984,6.8445020731896242E-3,7.5413281042008683E-3,24.338128345588984,-0.84546791360275608,23.492660431986227,6.2601961445311518E-3,6.9483830696259567E-3,23.492660431986231,-0.84546791360275608,22.647192518383473,5.6758902158726837E-3,6.3554380350510468E-3,22.647192518383477,-0.84546791360275608,21.80172460478072,5.0915842872142139E-3,5.7624930004761352E-3,21.80172460478072,-0.84546791360275608,20.956256691177963,4.5072783585557424E-3,5.1695479659012254E-3,20.956256691177966,-0.84546791360275608,20.110788777575209,3.9229724298972726E-3,4.5766029313263137E-3,20.110788777575213,-6.6107887775752117,13.5,-6.4576757040152657E-4,-5.9687006139614099E-5,13.5,0,13.5,-6.4576757040152657E-4,-5.9687006139614099E-5]
[3,18.993522734376576,16,14.846753246753247,28.580000000000005,26.180000000000003,18.993522734376576,0.42499999999999999,19.418522734376577,3.6474252535954844E-4,3.7711219410069264E-4,19.418522734376577,0.71864772656234266,20.137170460938918,1.0013088037909303E-3,1.0364411090404793E-3,20.137170460938918,0.75437650822027924,20.891546969159197,1.6994110572245739E-3,1.7614479791823625E-3,20.891546969159197,0.77609438948090526,21.667641358640104,2.4543748099909836E-3,2.5481864810388446E-3,21.667641358640104,0.791881606412141,22.459522965052244,3.2698072887086208E-3,3.4016955307216703E-3,22.459522965052241,0.80434794452036451,23.263870909572606,4.1541302757835026E-3,4.3327756999788462E-3,23.263870909572606,0.81467922870436504,24.07855013827697,5.1210841141404312E-3,5.3592540822193198E-3,24.07855013827697,0.8235176637082281,24.902067801985197,6.1923853068794202E-3,6.510520762190759E-3,24.902067801985201,1.2770821980148013,26.179150000000003,8.1278880873593817E-3,8.6538842129732767E-3,26.180000000000003,-0.79849747395815851,25.381502526041846,7.5631965860207774E-3,8.0803082225929055E-3,25.381502526041846,-0.79849747395815851,24.583005052083688,6.9970636121452464E-3,7.5050887713259042E-3,24.583005052083688,-0.79849747395815851,23.784507578125531,6.4309306382697162E-3,6.9298693200589047E-3,23.784507578125531,-0.79849747395815851,22.986010104167374,5.8647976643941852E-3,6.3546498687919051E-3,22.986010104167374,-0.79849747395815851,22.187512630209216,5.2986646905186559E-3,5.7794304175249039E-3,22.187512630209216,-0.79849747395815851,21.389015156251059,4.7325317166431249E-3,5.2042109662579043E-3,21.389015156251059,-0.79849747395815851,20.590517682292901,4.1663987427675948E-3,4.6289915149909048E-3,20.590517682292901,-0.79849747395815851,19.792020208334744,3.6002657688920638E-3,4.0537720637239035E-3,19.792020208334744,-0.79849747395815851,18.993522734376587,3.0341327950165337E-3,3.4785526124569031E-3,18.993522734376587,-6.2435227343765884,12.749999999999998,-1.3925112562798939E-3,-1.0191394133407103E-3,12.75,0,12.75,-1.3925112562798922E-3,-1.0191394133407094E-3]
[4,17.876256691177954,16,14.462337662337662,27.840000000000003,24.640000000000004,17.876256691177954,0.4,18.276256691177952,3.4080237227763479E-4,3.5277244881859162E-4,18.276256691177956,0.67637433088220489,18.95263102206016,9.337165540301473E-4,9.6751267891053881E-4,18.95263102206016,0.71000141950143936,19.662632441561598,1.5809284183540369E-3,1.6401697377893053E-3,19.662632441561598,0.7304417783349697,20.393074219896569,2.2768289528152666E-3,2.3656018814031251E-3,20.393074219896569,0.74530033544672092,21.13837455534329,3.0230528206819799E-3,3.1464300546953003E-3,21.13837455534329,0.75703335954857842,21.895407914891869,3.824864731477742E-3,3.9894975036306223E-3,21.895407914891866,0.76675692113352012,22.662164836025386,4.6909474718798581E-3,4.9060157930101451E-3,22.662164836025386,0.77507544819597951,23.437240284221367,5.6344583883246894E-3,5.9134218476020548E-3,23.437240284221367,1.2019597157786366,24.639200000000002,7.2807012222360105E-3,7.7042946547976957E-3,24.640000000000004,-0.75152703431356105,23.888472965686443,6.7348977570415684E-3,7.1490471715311733E-3,23.888472965686447,-0.75152703431356105,23.136945931372885,6.187903828936003E-3,6.5924837205406251E-3,23.136945931372885,-0.75152703431356105,22.385418897059324,5.6409099008304358E-3,6.035920269550076E-3,22.385418897059324,-0.75152703431356105,21.633891862745763,5.0939159727248686E-3,5.4793568185595269E-3,21.633891862745767,-0.75152703431356105,20.882364828432205,4.5469220446193032E-3,4.9227933675689796E-3,20.882364828432205,-0.75152703431356105,20.130837794118644,3.999928116513736E-3,4.3662299165784305E-3,20.130837794118648,-0.75152703431356105,19.379310759805087,3.452934188408171E-3,3.8096664655878831E-3,19.379310759805087,-0.75152703431356105,18.627783725491526,2.9059402603026033E-3,3.2531030145973336E-3,18.627783725491526,-0.75152703431356105,17.876256691177964,2.3589463321970353E-3,2.6965395636067845E-3,17.876256691177968,-5.8762566911779661,12.000000000000002,-1.9180478187851083E-3,-1.6552795375325011E-3,12,0,12,-1.9180478187851117E-3,-1.655279537532502E-3]
[5,16.758990647979331,16,14.077922077922077,27.1,23.1,16.758990647979331,0.375,17.133990647979331,3.1755552889560658E-4,3.2917895058662066E-4,17.133990647979331,0.63410093520206701,17.768091583181398,8.6843271198784534E-4,9.0107463300899632E-4,17.768091583181402,0.66562633078259936,18.433717913964003,1.4672348467422965E-3,1.5240816325481667E-3,18.433717913963999,0.68478916718903404,19.118507081153034,2.1078005391599796E-3,2.1923147459876231E-3,19.118507081153034,0.69871906448130083,19.817226145634336,2.7904086403776891E-3,2.9067307305298343E-3,19.817226145634333,0.70971877457679222,20.526944920211125,3.5181978099662501E-3,3.671531270721996E-3,20.526944920211122,0.71883461356267508,21.245779533773796,4.2966211717657306E-3,4.4937843218227948E-3,21.245779533773799,0.7266332326837307,21.972412766457531,5.1337829316565435E-3,5.3841206599906169E-3,21.972412766457531,1.1268372335424717,23.099250000000001,6.5596871117753024E-3,6.9201941670056569E-3,23.1,-0.70455659466896337,22.395443405331037,6.0338892479916105E-3,6.3843935025165895E-3,22.39544340533104,-0.70455659466896337,21.690886810662075,5.5070795976759181E-3,5.847491713305961E-3,21.690886810662079,-0.70455659466896337,20.986330215993114,4.9802699473602248E-3,5.3105899240953307E-3,20.986330215993117,-0.70455659466896337,20.281773621324152,4.4534602970445324E-3,4.7736881348847005E-3,20.281773621324156,-0.70455659466896337,19.577217026655191,3.92665064672884E-3,4.236786345674072E-3,19.577217026655191,-0.70455659466896337,18.872660431986226,3.3998409964131446E-3,3.6998845564634401E-3,18.87266043198623,-0.70455659466896337,18.168103837317265,2.8730313460974522E-3,3.1629827672528116E-3,18.168103837317268,-0.70455659466896337,17.463547242648303,2.3462216957817594E-3,2.6260809780421814E-3,17.463547242648303,-0.70455659466896337,16.758990647979338,1.8194120454660644E-3,2.0891791888315498E-3,16.758990647979342,-5.5089906479793429,11.25,-2.2997594431182142E-3,-2.1089036309516612E-3,11.25,0,11.25,-2.2997594431182142E-3,-2.108903630951663E-3]
[6,15.641724604780709,16,13.693506493506494,26.360000000000003,21.560000000000002,15.641724604780709,0.35,15.991724604780709,2.9490704789649061E-4,3.0623128839604859E-4,15.991724604780709,0.59182753952192924,16.583552144302637,8.0513742512505532E-4,8.3678506855645028E-4,16.58355214430264,0.62125124206375937,17.2048033863664,1.3576427979352865E-3,1.4124388223387915E-3,17.204803386366397,0.63913655604309849,17.843939942409495,1.945993008027244E-3,2.0268967735936117E-3,17.843939942409495,0.65213779351588075,18.496077735925375,2.5695464466481744E-3,2.6799775435129318E-3,18.496077735925375,0.66240418960500602,19.158481925530381,3.2299997296835123E-3,3.3740987698248812E-3,19.158481925530381,0.67091230599182994,19.829394231522212,3.9306987735245168E-3,4.1136599726451237E-3,19.829394231522212,0.678191017171482,20.507585248693694,4.6766435501558196E-3,4.9052132409061816E-3,20.507585248693694,1.0517147513063068,21.5593,5.9248764614656113E-3,6.2422817866204568E-3,21.560000000000002,-0.65758615502436579,20.902413844975637,5.4202584295110524E-3,5.7270738387513315E-3,20.902413844975637,-0.65758615502436579,20.244827689951272,4.9147663168914923E-3,5.2109229572837052E-3,20.244827689951272,-0.65758615502436579,19.587241534926907,4.4092742042719322E-3,4.6947720758160789E-3,19.587241534926907,-0.65758615502436579,18.929655379902542,3.9037820916523716E-3,4.1786211943484518E-3,18.929655379902542,-0.65758615502436579,18.272069224878177,3.3982899790328115E-3,3.6624703128808256E-3,18.272069224878177,-0.65758615502436579,17.614483069853812,2.8927978664132514E-3,3.146319431413198E-3,17.614483069853812,-0.65758615502436579,16.956896914829446,2.3873057537936913E-3,2.6301685499455717E-3,16.95689691482945,-0.65758615502436579,16.299310759805085,1.8818136411741342E-3,2.1140176684779468E-3,16.299310759805085,-0.65758615502436579,15.64172460478072,1.376321528554574E-3,1.5978667870103192E-3,15.64172460478072,-5.1417246047807197,10.5,-2.5761662376793072E-3,-2.4379628403987607E-3,10.5,0,10.5,-2.5761662376793072E-3,-2.4379628403987607E-3]
[6.67,14.893156355837633,16,13.435948051948053,25.864200000000004,20.528200000000002,14.893156355837633,0.33324999999999999,15.226406355837632,2.8002413980975549E-4,1.926019478815924E-4,15.226406355837632,0.56350436441623686,15.78991072025387,7.6369919615797426E-4,5.2556026812981479E-4,15.78991072025387,0.59151993262213665,16.381430652876006,1.2862101448404503E-3,8.8569073582987171E-4,16.381430652876006,0.60854930657532158,16.989979959451325,1.8410693928167174E-3,1.2686659042827268E-3,16.989979959451329,0.62092834196904934,17.610908301420377,2.4271992325204084E-3,1.6739098025214752E-3,17.610908301420377,0.63070341767390936,18.241611719094287,3.0456001289469619E-3,2.1023259526412085E-3,18.241611719094283,0.63880435991936391,18.880416079013646,3.6986234643564962E-3,2.5558229496901392E-3,18.880416079013649,0.64573473277827531,19.526150811791926,4.3898619566105314E-3,3.0372793447667268E-3,19.526150811791926,1.0013826882080765,20.527533500000001,5.5356532667219308E-3,3.8392774589428263E-3,20.528200000000002,-0.62611596046248552,19.902084039537517,5.0459232167784102E-3,3.5061708515069698E-3,19.902084039537517,-0.62611596046248552,19.275968079075032,4.5553962889296404E-3,3.1725044729500793E-3,19.275968079075032,-0.62611596046248552,18.649852118612547,4.0648693610808705E-3,2.8388380943931888E-3,18.64985211861255,-0.62611596046248552,18.023736158150065,3.5743424332321042E-3,2.5051717158362991E-3,18.023736158150065,-0.62611596046248552,17.39762019768758,3.0838155053833347E-3,2.1715053372794086E-3,17.39762019768758,-0.62611596046248552,16.771504237225095,2.5932885775345653E-3,1.8378389587225185E-3,16.771504237225095,-0.62611596046248552,16.14538827676261,2.1027616496857963E-3,1.5041725801656282E-3,16.14538827676261,-0.62611596046248552,15.519272316300125,1.6122347218370265E-3,1.1705062016087388E-3,15.519272316300126,-0.62611596046248552,14.893156355837641,1.1217077939882593E-3,8.3683982305184903E-4,14.893156355837643,-4.8956563558376427,9.9975000000000005,-2.7137658621352668E-3,-1.7721272534378821E-3,9.9975000000000005,0,9.9975000000000005,-2.7137658621352668E-3,-1.7721272534378821E-3]
[""]
["",null,null,null,null,null,null,null,null,null,null,null,null,null,null,null,null,null,null,null,null,null,null,null,null,null,null,null,null,null,null,null,null,null,null,null,null,null,null,null,null,null,null,null,null,null,null,null,null,null,null,null,null," d (x)",{"$f":"def_cR*($E$39-BB$39)/($E$39-cR)","v":1.189125054293607E-2},null,null,null," d (x)",{"$f":"def_cR*($E$39-BG$39)/($E$39-cR)","v":2.378250108587214E-2},null,null,null," d (x)",{"$f":"def_cR*($E$39-BL$39)/($E$39-cR)","v":3.567375162880821E-2},null,null,null," d (x)",{"$f":"def_cR*($E$39-BQ$39)/($E$39-cR)","v":4.7565002171744281E-2},null,null,null," d (x)",{"$f":"def_cR*($E$39-BV$39)/($E$39-cR)","v":5.9456252714680344E-2},null,null,null," d (x)",{"$f":"def_cR*($E$39-CA$39)/($E$39-cR)","v":7.1347503257616421E-2},null,null,null," d (x)",{"$f":"def_cR*($E$39-CF$39)/($E$39-cR)","v":8.3238753800552484E-2},null,null,null," d (x)",{"$f":"def_cR*($E$39-CK$39)/($E$39-cR)","v":9.5130004343488561E-2},null,null,null," d (x)",{"$f":"def_cR*($E$39-CP$39)/($E$39-cR)","v":0.10702125488642462},null,null,null," d (x)",{"$f":"def_cR*($E$39-CU$39)/($E$39-cR)","v":0.2},null,null,null," d (x)",{"$f":"def_cR*($E$39-CZ$39)/($E$39-cR)","v":0.2}]
[null,null,null,null,null,null,null,null,null,null,null,null,null,null,null,null,null,null,null,null,null,null,null,null,null,null,null,null,null,null,null,null,null,null,null,null,null,null,null,null,null,null,null,null,null,null,null,null,null,null,null,null,null," d (slip)",{"$f":"IF((BB39-cR)<1,IF((BC53-BC48-SUM(BD39:BD46))<0,BC53-BC48-SUM(BD39:BD46),0),0)","v":0},null,null,null," d (slip)",{"$f":"IF((BG39-cR)<1,IF((BH53-BH48-SUM(BI39:BI46))<0,BH53-BH48-SUM(BI39:BI46),0),0)","v":0},null,null,null," d (slip)",{"$f":"IF((BL39-cR)<1,IF((BM53-BM48-SUM(BN39:BN46))<0,BM53-BM48-SUM(BN39:BN46),0),0)","v":0},null,null,null," d (slip)",{"$f":"IF((BQ39-cR)<1,IF((BR53-BR48-SUM(BS39:BS46))<0,BR53-BR48-SUM(BS39:BS46),0),0)","v":0},null,null,null," d (slip)",{"$f":"IF((BV39-cR)<1,IF((BW53-BW48-SUM(BX39:BX46))<0,BW53-BW48-SUM(BX39:BX46),0),0)","v":0},null,null,null," d (slip)",{"$f":"IF((CA39-cR)<1,IF((CB53-CB48-SUM(CC39:CC46))<0,CB53-CB48-SUM(CC39:CC46),0),0)","v":0},null,null,null," d (slip)",{"$f":"IF((CF39-cR)<1,IF((CG53-CG48-SUM(CH39:CH46))<0,CG53-CG48-SUM(CH39:CH46),0),0)","v":0},null,null,null," d (slip)",{"$f":"IF((CK39-cR)<1,IF((CL53-CL48-SUM(CM39:CM46))<0,CL53-CL48-SUM(CM39:CM46),0),0)","v":0},null,null,null," d (slip)",{"$f":"IF((CP39-cR)<1,IF((CQ53-CQ48-SUM(CR39:CR46))<0,CQ53-CQ48-SUM(CR39:CR46),0),0)","v":0},null,null,null," d (slip)",{"$f":"IF((CU39-cR)<=1,IF((CV53-CV48-SUM(CW39:CW46))<0,CV53-CV48-SUM(CW39:CW46),0),0)","v":-6.388172416982163E-2},null,null,null," d (slip)",{"$f":"DA53-SUM(DB39:DB46)-DA48","v":1.5135708867799108E-2}]
["D N",null,null,null,null,null,null,null,"D N",{"$f":"(((I39+G39)/2)-$B$39)*$B$30","v":9.0964565147526262},null,null,null,"D N",{"$f":"(((N39+L39)/2)-$B$39)*C30","v":15.724546548005129},null,null,null,"D N",{"$f":"(((S39+Q39)/2)-$B$39)*D30","v":17.021260885617803},null,null,null,"D N",{"$f":"(((X39+V39)/2)-$B$39)*E30","v":18.141356501178837},null,null,null,"D N",{"$f":"(((AC39+AA39)/2)-$B$39)*F30","v":19.286193438453218},null,null,null,"D N",{"$f":"(((AH39+AF39)/2)-$B$39)*G30","v":20.576632358754889},null,null,null,"D N",{"$f":"(((AM39+AK39)/2)-$B$39)*H30","v":22.135861784956948},null,null,null,"D N",{"$f":"(((AR39+AP39)/2)-$B$39)*I30","v":24.250648699232567},null,null,null,"D N",{"$f":"(((AW39+AU39)/2)-$B$39)*J30","v":46.792250799617037},null,null,null,"D N",{"$f":"(((BB39+AZ39)/2)-$B$39)*K30","v":22.373471644984058},null,null,null,"D N",{"$f":"(((BG39+BE39)/2)-$B$39)*L30","v":17.785926633477835},null,null,null,"D N",{"$f":"(((BL39+BJ39)/2)-$B$39)*M30","v":14.377679256482748},null,null,null,"D N",{"$f":"(((BQ39+BO39)/2)-$B$39)*N30","v":11.544325678641227},null,null,null,"D N",{"$f":"(((BV39+BT39)/2)-$B$39)*O30","v":9.0775636623688758},null,null,null,"D N",{"$f":"(((CA39+BY39)/2)-$B$39)*P30","v":6.8530461784306622},null,null,null,"D N",{"$f":"(((CF39+CD39)/2)-$B$39)*Q30","v":4.7904484702559893},null,null,null,"D N",{"$f":"(((CK39+CI39)/2)-$B$39)*R30","v":2.8368533613918561},null,null,null,"D N",{"$f":"(((CP39+CN39)/2)-$B$39)*S30","v":0.93913796826323082},null,null,null,"D N",{"$f":"(((CU39+CS39)/2)-$B$39)*T30","v":-6.7911303194260698E-12},null,null,null,"D N",{"$f":"(((CZ39+CX39)/2)-$B$39)*U30","v":-283.60308317210502}]
["SD N",null,null,null,null,null,null,null,"SD N",{"$f":"J50","v":9.0964565147526262},null,null,null,"SD N",{"$f":"O50+J51","v":24.821003062757754},null,null,null,"SD N",{"$f":"T50+O51","v":41.84226394837556},null,null,null,"SD N",{"$f":"Y50+T51","v":59.983620449554394},null,null,null,"SD N",{"$f":"AD50+Y51","v":79.269813888007604},null,null,null,"SD N",{"$f":"AI50+AD51","v":99.846446246762497},null,null,null,"SD N",{"$f":"AN50+AI51","v":121.98230803171944},null,null,null,"SD N",{"$f":"AS50+AN51","v":146.232956730952},null,null,null,"SD N",{"$f":"AX50+AS51","v":193.02520753056905},null,null,null,"SD N",{"$f":"AX51+BC50","v":215.3986791755531},null,null,null,"SD N",{"$f":"BC51+BH50","v":233.18460580903093},null,null,null,"SD N",{"$f":"BM50+BH51","v":247.56228506551366},null,null,null,"SD N",{"$f":"BR50+BM51","v":259.10661074415486},null,null,null,"SD N",{"$f":"BW50+BR51","v":268.18417440652377},null,null,null,"SD N",{"$f":"CB50+BW51","v":275.03722058495441},null,null,null,"SD N",{"$f":"CG50+CB51","v":279.82766905521038},null,null,null,"SD N",{"$f":"CL50+CG51","v":282.66452241660221},null,null,null,"SD N",{"$f":"CQ50+CL51","v":283.60366038486546},null,null,null,"SD N",{"$f":"CV50+CQ51","v":283.6036603848587},null,null,null,"SD N",{"$f":"DA50+CV51","v":5.77212753682943E-4}]
[" d (N)",null,null,null,null,null,null,null," d (N)",{"$f":"(J50+0)/2*B30/Emean/Height","v":2.3884409681393325E-3},null,null,null," d (N)",{"$f":"(J51+O50/2)*C30/Emean/Height","v":4.1709498551103239E-3},null,null,null," d (N)",{"$f":"(O51+T50/2)*D30/Emean/Height","v":4.5764096626770435E-3},null,null,null," d (N)",{"$f":"(T51+Y50/2)*E30/Emean/Height","v":4.9564086178878961E-3},null,null,null," d (N)",{"$f":"(Y51+AD50/2)*F30/Emean/Height","v":5.3658014896914887E-3},null,null,null," d (N)",{"$f":"(AD51+AI50/2)*G30/Emean/Height","v":5.8442964528463729E-3},null,null,null," d (N)",{"$f":"(AI51+AN50/2)*H30/Emean/Height","v":6.4389046506369216E-3},null,null,null," d (N)",{"$f":"(AN51+AS50/2)*I30/Emean/Height","v":7.2581669601271713E-3},null,null,null," d (N)",{"$f":"(AS51+AX50/2)*J30/Emean/Height","v":1.4872539737037652E-2},null,null,null," d (N)",{"$f":"(AX51+BC50/2)*K30/Emean/Height","v":8.2581162146516986E-3},null,null,null," d (N)",{"$f":"(BC51+BH50/2)*L30/Emean/Height","v":8.171724647448083E-3},null,null,null," d (N)",{"$f":"(BH51+BM50/2)*M30/Emean/Height","v":8.1685942200414186E-3},null,null,null," d (N)",{"$f":"(BM51+BR50/2)*N30/Emean/Height","v":8.1693128664100424E-3},null,null,null," d (N)",{"$f":"(BR51+BW50/2)*O30/Emean/Height","v":8.1707585215194806E-3},null,null,null," d (N)",{"$f":"(BW51+CB50/2)*P30/Emean/Height","v":8.1704858953970567E-3},null,null,null," d (N)",{"$f":"(CB51+CG50/2)*Q30/Emean/Height","v":8.1673057329709579E-3},null,null,null," d (N)",{"$f":"(CG51+CL50/2)*R30/Emean/Height","v":8.1717962661034295E-3},null,null,null," d (N)",{"$f":"(CL51+CQ50/2)*S30/Emean/Height","v":8.1702803555963929E-3},null,null,null," d (N)",{"$f":"(CQ51+CV50/2)*T30/Emean/Height","v":7.5685579592171633E-15},null,null,null," d (N)",{"$f":"(CV51+DA50/2)*U30/Emean/Height","v":7.9017433037620738E-2}]
["S d (N)",null,null,null,null,null,null,null,"S d (N)",{"$f":"J52","v":2.3884409681393325E-3},null,null,null,"S d (N)",{"$f":"O52+J53","v":6.559390823249656E-3},null,null,null,"S d (N)",{"$f":"T52+O53","v":1.1135800485926699E-2},null,null,null,"S d (N)",{"$f":"Y52+T53","v":1.6092209103814595E-2},null,null,null,"S d (N)",{"$f":"AD52+Y53","v":2.1458010593506084E-2},null,null,null,"S d (N)",{"$f":"AI52+AD53","v":2.7302307046352458E-2},null,null,null,"S d (N)",{"$f":"AN52+AI53","v":3.3741211696989376E-2},null,null,null,"S d (N)",{"$f":"AS52+AN53","v":4.0999378657116545E-2},null,null,null,"S d (N)",{"$f":"AX52+AS53","v":5.5871918394154195E-2},null,null,null,"S d (N)",{"$f":"BC52+AX53","v":6.4130034608805897E-2},null,null,null,"S d (N)",{"$f":"BH52+BC53","v":7.2301759256253983E-2},null,null,null,"S d (N)",{"$f":"BM52+BH53","v":8.04703534762954E-2},null,null,null,"S d (N)",{"$f":"BR52+BM53","v":8.8639666342705439E-2},null,null,null,"S d (N)",{"$f":"BW52+BR53","v":9.681042486422492E-2},null,null,null,"S d (N)",{"$f":"CB52+BW53","v":0.10498091075962197},null,null,null,"S d (N)",{"$f":"CG52+CB53","v":0.11314821649259293},null,null,null,"S d (N)",{"$f":"CL52+CG53","v":0.12132001275869636},null,null,null,"S d (N)",{"$f":"CQ52+CL53","v":0.12949029311429275},null,null,null,"S d (N)",{"$f":"CV52+CQ53","v":0.12949029311430033},null,null,null,"S d (N)",{"$f":"DA52+CV53","v":0.20850772615192106}]
["S d (t)",null,null,null,null,null,null,null,"S d (t)",{"$f":"SUM(def)","v":2.3887035218823384E-3},null,null,null,"S d (t)",{"$f":"SUM(P39:P49)","v":6.5590226537433818E-3},null,null,null,"S d (t)",{"$f":"SUM(U39:U49)","v":1.1135866753874788E-2},null,null,null,"S d (t)",{"$f":"SUM(Z39:Z49)","v":1.6092072048229423E-2},null,null,null,"S d (t)",{"$f":"SUM(AE39:AE49)","v":2.145780021516518E-2},null,null,null,"S d (t)",{"$f":"SUM(AJ39:AJ49)","v":2.7301417923023479E-2},null,null,null,"S d (t)",{"$f":"SUM(AO39:AO49)","v":3.3742315550785246E-2},null,null,null,"S d (t)",{"$f":"SUM(AT39:AT49)","v":4.0999621517408505E-2},null,null,null,"S d (t)",{"$f":"SUM(AY39:AY49)","v":5.5870895098900669E-2},null,null,null,"S d (t)",{"$f":"SUM(BD39:BD47)+BC48+BC49","v":6.4130133173724874E-2},null,null,null,"S d (t)",{"$f":"SUM(BI39:BI47)+BH48+BH49","v":7.2300128610054248E-2},null,null,null,"S d (t)",{"$f":"SUM(BN39:BN47)+BM48+BM49","v":8.0470124046383651E-2},null,null,null,"S d (t)",{"$f":"SUM(BS39:BS47)+BR48+BR49","v":8.8640119482713026E-2},null,null,null,"S d (t)",{"$f":"SUM(BX39:BX47)+BW48+BW49","v":9.6810114919042414E-2},null,null,null,"S d (t)",{"$f":"SUM(CC39:CC47)+CB48+CB49","v":0.1049801103553718},null,null,null,"S d (t)",{"$f":"SUM(CH39:CH47)+CG48+CG49","v":0.11315010579170118},null,null,null,"S d (t)",{"$f":"SUM(CM39:CM47)+CL48+CL49","v":0.12132010122803057},null,null,null,"S d (t)",{"$f":"SUM(CR39:CR47)+CQ48+CQ49","v":0.12949009666435993},null,null,null,"S d (t)",{"$f":"SUM(CW39:CW47)+CV48+CV49","v":0.12949029311430033},null,null,null,"S d (t)",{"$f":"SUM(DB39:DB47)+DA48+DA49","v":0.20850772615192106}]
["Difference",null,"sum stage I",{"$f":"SUM(I55:AX55)","v":4.3035577937809884E-2},null,null,null,null,null,{"$f":"ABS(J53-J54)*10000","v":2.6255374300588122E-3},null,null,null,null,{"$f":"ABS(O53-O54)*10000","v":3.6816950627419076E-3},null,null,null,null,{"$f":"ABS(T53-T54)*10000","v":6.6267948089018813E-4},null,null,null,null,{"$f":"ABS(Y53-Y54)*10000","v":1.3705558517262961E-3},null,null,null,null,{"$f":"ABS(AD53-AD54)*10000","v":2.1037834090423257E-3},null,null,null,null,{"$f":"ABS(AI53-AI54)*10000","v":8.891233289794187E-3},null,null,null,null,{"$f":"ABS(AN53-AN54)*10000","v":1.1038537958696359E-2},null,null,null,null,{"$f":"ABS(AS53-AS54)*10000","v":2.4286029196018966E-3},null,null,null,null,{"$f":"ABS(AX53-AX54)*10000","v":1.0232952535257911E-2},null,null,null,null,{"$f":"ABS(BC53-BC54)*10000","v":9.8564918976640215E-4},null,null,null,null,{"$f":"ABS(BH53-BH54)*10000","v":1.6306461997350752E-2},null,null,null,null,{"$f":"ABS(BM53-BM54)*10000","v":2.2942991174945693E-3},null,null,null,null,{"$f":"ABS(BR53-BR54)*10000","v":4.5314000758633899E-3},null,null,null,null,{"$f":"ABS(BW53-BW54)*10000","v":3.0994518250559988E-3},null,null,null,null,{"$f":"ABS(CB53-CB54)*10000","v":8.0040425017025019E-3},null,null,null,null,{"$f":"ABS(CG53-CG54)*10000","v":1.8892991082430921E-2},null,null,null,null,{"$f":"ABS(CL53-CL54)*10000","v":8.846933420569858E-4},null,null,null,null,{"$f":"ABS(CQ53-CQ54)*10000","v":1.9644993282108558E-3},null,null,null,null,{"$f":"ABS(CV53-CV54)*10000","v":0},null,null,null,null,{"$f":"ABS(DA53-DA54)*10000","v":0}]
["Compatibility",null,"sum stage II",{"$f":"SUM(BC55:DA55)","v":5.6963488459932377E-2},null,null,null,null,null,{"$f":"IF(ABS(J55)<=0.5,\"Ok\",\"Not ok\")","v":"Ok"},null,null,null,null,{"$f":"IF(ABS(O55)<=0.5,\"Ok\",\"Not ok\")","v":"Ok"},null,null,null,null,{"$f":"IF(ABS(T55)<=0.5,\"Ok\",\"Not ok\")","v":"Ok"},null,null,null,null,{"$f":"IF(ABS(Y55)<=0.5,\"Ok\",\"Not ok\")","v":"Ok"},null,null,null,null,{"$f":"IF(ABS(AD55)<=0.5,\"Ok\",\"Not ok\")","v":"Ok"},null,null,null,null,{"$f":"IF(ABS(AI55)<=0.5,\"Ok\",\"Not ok\")","v":"Ok"},null,null,null,null,{"$f":"IF(ABS(AN55)<=0.5,\"Ok\",\"Not ok\")","v":"Ok"},null,null,null,null,{"$f":"IF(ABS(AS55)<=0.5,\"Ok\",\"Not ok\")","v":"Ok"},null,null,null,null,{"$f":"IF(ABS(AX55)<=0.5,\"Ok\",\"Not ok\")","v":"Ok"},null,null,null,null,{"$f":"IF(ABS(BC55)<=0.5,\"Ok\",\"Not ok\")","v":"Ok"},null,null,null,null,{"$f":"IF(ABS(BH55)<=0.5,\"Ok\",\"Not ok\")","v":"Ok"},null,null,null,null,{"$f":"IF(ABS(BM55)<=0.5,\"Ok\",\"Not ok\")","v":"Ok"},null,null,null,null,{"$f":"IF(ABS(BR55)<=0.5,\"Ok\",\"Not ok\")","v":"Ok"},null,null,null,null,{"$f":"IF(ABS(BW55)<=0.5,\"Ok\",\"Not ok\")","v":"Ok"},null,null,null,null,{"$f":"IF(ABS(CB55)<=0.5,\"Ok\",\"Not ok\")","v":"Ok"},null,null,null,null,{"$f":"IF(ABS(CG55)<=0.5,\"Ok\",\"Not ok\")","v":"Ok"},null,null,null,null,{"$f":"IF(ABS(CL55)<=0.5,\"Ok\",\"Not ok\")","v":"Ok"},null,null,null,null,{"$f":"IF(ABS(CQ55)<=0.5,\"Ok\",\"Not ok\")","v":"Ok"},null,null,null,null,{"$f":"IF(ABS(CV55)<=0.5,\"Ok\",\"Not ok\")","v":"Ok"},null,null,null,null,{"$f":"IF(ABS(DA55)<=0.5,\"Ok\",\"Not ok\")","v":"Ok"}]
[null,null,"Both",{"$f":"D55+D56","v":9.9999066397742253E-2}]
[]
["t(x,z)"]
[null,null,"Stage I",null,null,null,null,null,null,null,null,"Stage II"]
[null,"start value","Dx1","Dx2","Dx3","Dx4","Dx5","Dx6","Dx7","Dx8","Dx9","Dx10","Dx11","Dx12","Dx13","Dx14","Dx15","Dx16","Dx17","Dx18","Dx19","Dx20","SDx"]
["Distance from X=0",0,{"$f":"($B$32+$C$32)/2","v":18},{"$f":"($C$32+$D$32)/2","v":44.5},{"$f":"($D$32+$E$32)/2","v":58},{"$f":"($E$32+$F$32)/2","v":66.5},{"$f":"($F$32+$G$32)/2","v":72.5},{"$f":"($G$32+$H$32)/2","v":77.5},{"$f":"($H$32+$I$32)/2","v":82},{"$f":"($I$32+$J$32)/2","v":85.5},{"$f":"($J$32+$K$32)/2","v":90},{"$f":"($K$32+$L$32)/2","v":94.5},{"$f":"($L$32+$M$32)/2","v":97.5},{"$f":"($M$32+$N$32)/2","v":100},{"$f":"($N$32+$O$32)/2","v":102},{"$f":"($O$32+$P$32)/2","v":104},{"$f":"($P$32+$Q$32)/2","v":106.5},{"$f":"($Q$32+$R$32)/2","v":109},{"$f":"($R$32+$S$32)/2","v":111},{"$f":"($S$32+$T$32)/2","v":113},{"$f":"($T$32+$U$32)/2","v":114}]
["Z från slip surface"]
[0,0,{"$f":"OFFSET($G39,0,(COLUMN(B1)-COLUMN($B$1))*5)","v":22.345320863972443},22.845320863972443,23.6907887775752,24.578290551951998,25.491342774870709,26.422968194179109,27.369259893614831,28.327706045031732,29.296550355276707,30.800000000000004,29.860591207108055,28.921182414216105,27.981773621324155,27.042364828432206,26.102956035540256,25.163547242648306,24.224138449756357,23.284729656864407,22.345320863972457,15]
[{"$f":"IF(A64<Height/3,A64+1,\"\")","v":1},0,21.228054820773821,{"$f":"OFFSET($G40,0,(COLUMN(cS)-COLUMN($B$1))*5)","v":21.703054820773819},22.506249338696438,23.349376024354395,24.216775636127174,25.101819784470152,26.000796898934087,26.911320742780145,27.831722837512871,29.26,28.367561646752652,27.475123293505298,26.582684940257945,25.690246587010595,24.797808233763242,23.905369880515888,23.012931527268538,22.120493174021185,21.228054820773835,14.25]
[2,0,20.110788777575198,{"$f":"OFFSET($G41,0,(COLUMN(C3)-COLUMN($B$1))*5)","v":20.560788777575198},{"$f":"OFFSET($G41,0,(COLUMN(D3)-COLUMN($B$1))*5)","v":21.32170989981768},{"$f":"OFFSET($G41,0,(COLUMN(#REF!)-COLUMN($B$1))*5)","v":{"$error":"#REF!"}},{"$f":"OFFSET($G41,0,(COLUMN(#REF!)-COLUMN($B$1))*5)","v":{"$error":"#REF!"}},{"$f":"OFFSET($G41,0,(COLUMN(#REF!)-COLUMN($B$1))*5)","v":{"$error":"#REF!"}},{"$f":"OFFSET($G41,0,(COLUMN(#REF!)-COLUMN($B$1))*5)","v":{"$error":"#REF!"}},25.494935440528561,26.366895319749037,27.720000000000006,26.874532086397249,26.029064172794495,25.183596259191741,24.338128345588984,23.492660431986231,22.647192518383477,21.80172460478072,20.956256691177966,20.110788777575213,13.5]
[3,0,18.993522734376576,{"$f":"OFFSET($G42,0,(COLUMN(c_peak)-COLUMN($B$1))*5)","v":19.418522734376577},{"$f":"OFFSET($G42,0,(COLUMN(D4)-COLUMN($B$1))*5)","v":20.137170460938918},20.891546969159197,21.667641358640104,22.459522965052241,23.263870909572606,24.07855013827697,24.902067801985201,26.180000000000003,25.381502526041846,24.583005052083688,23.784507578125531,22.986010104167374,22.187512630209216,21.389015156251059,20.590517682292901,19.792020208334744,18.993522734376587,12.75]
[4,0,17.876256691177954,{"$f":"OFFSET($G43,0,(COLUMN(cR)-COLUMN($B$1))*5)","v":18.276256691177956},18.95263102206016,19.662632441561598,20.393074219896569,21.13837455534329,21.895407914891866,22.662164836025386,23.437240284221367,24.640000000000004,23.888472965686447,23.136945931372885,22.385418897059324,21.633891862745767,20.882364828432205,20.130837794118648,19.379310759805087,18.627783725491526,17.876256691177968,12]
[5,0,16.758990647979331,{"$f":"OFFSET($G44,0,(COLUMN(tel)-COLUMN($B$1))*5)","v":17.133990647979331},17.768091583181402,18.433717913963999,19.118507081153034,19.817226145634333,20.526944920211122,21.245779533773799,21.972412766457531,23.1,22.39544340533104,21.690886810662079,20.986330215993117,20.281773621324156,19.577217026655191,18.87266043198623,18.168103837317268,17.463547242648303,16.758990647979342,11.25]
[6,0,15.641724604780709,{"$f":"OFFSET($G45,0,(COLUMN(gel)-COLUMN($B$1))*5)","v":15.991724604780709},16.58355214430264,17.204803386366397,17.843939942409495,18.496077735925375,19.158481925530381,19.829394231522212,20.507585248693694,21.560000000000002,20.902413844975637,20.244827689951272,19.587241534926907,18.929655379902542,18.272069224878177,17.614483069853812,16.95689691482945,16.299310759805085,15.64172460478072,10.5]
[7,0,14.893156355837633,{"$f":"OFFSET($G46,0,(COLUMN(g_f)-COLUMN($B$1))*5)","v":15.226406355837632},15.78991072025387,16.381430652876006,16.989979959451329,17.610908301420377,18.241611719094283,18.880416079013649,19.526150811791926,20.528200000000002,19.902084039537517,19.275968079075032,18.64985211861255,18.023736158150065,17.39762019768758,16.771504237225095,16.14538827676261,15.519272316300126,14.893156355837643,9.9975000000000005]
[""]
[""]
[""]
["Dt"]
[null,null,"Stage I",null,null,null,null,null,null,null,null,"Stage II"]
[null,"start value","Dx1","Dx2","Dx3","Dx4","Dx5","Dx6","Dx7","Dx8","Dx9","Dx10","Dx11","Dx12","Dx13","Dx14","Dx15","Dx16","Dx17","Dx18","Dx19","Dx20","SDx"]
["Distance from X=0",0,{"$f":"($B$32+$C$32)/2","v":18},{"$f":"($C$32+$D$32)/2","v":44.5},{"$f":"($D$32+$E$32)/2","v":58},{"$f":"($E$32+$F$32)/2","v":66.5},{"$f":"($F$32+$G$32)/2","v":72.5},{"$f":"($G$32+$H$32)/2","v":77.5},{"$f":"($H$32+$I$32)/2","v":82},{"$f":"($I$32+$J$32)/2","v":85.5},{"$f":"($J$32+$K$32)/2","v":90},{"$f":"($K$32+$L$32)/2","v":94.5},{"$f":"($L$32+$M$32)/2","v":97.5},{"$f":"($M$32+$N$32)/2","v":100},{"$f":"($N$32+$O$32)/2","v":102},{"$f":"($O$32+$P$32)/2","v":104},{"$f":"($P$32+$Q$32)/2","v":106.5},{"$f":"($Q$32+$R$32)/2","v":109},{"$f":"($R$32+$S$32)/2","v":111},{"$f":"($S$32+$T$32)/2","v":113},{"$f":"($T$32+$U$32)/2","v":114}]
["Z från slip surface"]
[0,0,{"$f":"OFFSET($H39,0,(COLUMN(B$1)-COLUMN($B$1))*5)","v":0.5},0.84546791360275608,0.88750177437679911,0.91305222291871213,0.93162541930840115,0.946291699435723,0.95844615141690004,0.9688443102449743,1.5024496447232956,-0.93940879289195123,-0.93940879289195123,-0.93940879289195123,-0.93940879289195123,-0.93940879289195123,-0.93940879289195123,-0.93940879289195123,-0.93940879289195123,-0.93940879289195123,-7.3453208639724572,0]
[{"$f":"IF(A80<Height/3,A80+1,\"\")","v":1},0,0.47499999999999998,0.8031945179226182,0.84312668565795912,0.86739961177277647,0.88504414834298106,0.8989771144639368,0.910523843846055,0.9204020947327255,1.4273271624871307,-0.89243835324735366,-0.89243835324735366,-0.89243835324735366,-0.89243835324735366,-0.89243835324735366,-0.89243835324735366,-0.89243835324735366,-0.89243835324735366,-0.89243835324735366,-6.978054820773834,0]
[2,0,0.45,0.76092112224248054,0.79875159693911923,0.82174700062684092,0.83846287737756109,0.85166252949215071,0.86260153627521008,0.87195987922047691,1.352204680250966,-0.84546791360275608,-0.84546791360275608,-0.84546791360275608,-0.84546791360275608,-0.84546791360275608,-0.84546791360275608,-0.84546791360275608,-0.84546791360275608,-0.84546791360275608,-6.6107887775752117,0]
[3,0,0.42499999999999999,0.71864772656234266,0.75437650822027924,0.77609438948090526,0.791881606412141,0.80434794452036451,0.81467922870436504,0.8235176637082281,1.2770821980148013,-0.79849747395815851,-0.79849747395815851,-0.79849747395815851,-0.79849747395815851,-0.79849747395815851,-0.79849747395815851,-0.79849747395815851,-0.79849747395815851,-0.79849747395815851,-6.2435227343765884,0]
[4,0,0.4,0.67637433088220489,0.71000141950143936,0.7304417783349697,0.74530033544672092,0.75703335954857842,0.76675692113352012,0.77507544819597951,1.2019597157786366,-0.75152703431356105,-0.75152703431356105,-0.75152703431356105,-0.75152703431356105,-0.75152703431356105,-0.75152703431356105,-0.75152703431356105,-0.75152703431356105,-0.75152703431356105,-5.8762566911779661,0]
[5,0,0.375,0.63410093520206701,0.66562633078259936,0.68478916718903404,0.69871906448130083,0.70971877457679222,0.71883461356267508,0.7266332326837307,1.1268372335424717,-0.70455659466896337,-0.70455659466896337,-0.70455659466896337,-0.70455659466896337,-0.70455659466896337,-0.70455659466896337,-0.70455659466896337,-0.70455659466896337,-0.70455659466896337,-5.5089906479793429,0]
[6,0,0.35,0.59182753952192924,0.62125124206375937,0.63913655604309849,0.65213779351588075,0.66240418960500602,0.67091230599182994,0.678191017171482,1.0517147513063068,-0.65758615502436579,-0.65758615502436579,-0.65758615502436579,-0.65758615502436579,-0.65758615502436579,-0.65758615502436579,-0.65758615502436579,-0.65758615502436579,-0.65758615502436579,-5.1417246047807197,0]
[7,0,0.33324999999999999,0.56350436441623686,0.59151993262213665,0.60854930657532158,0.62092834196904934,0.63070341767390936,0.63880435991936391,0.64573473277827531,1.0013826882080765,-0.62611596046248552,-0.62611596046248552,-0.62611596046248552,-0.62611596046248552,-0.62611596046248552,-0.62611596046248552,-0.62611596046248552,-0.62611596046248552,-0.62611596046248552,-4.8956563558376427,0]
[""]
[""]
[""]
["t+Dt"]
[null,null,"Stage I",null,null,null,null,null,null,null,null,"Stage II"]
[null,null,"Dx1","Dx2","Dx3","Dx4","Dx5","Dx6","Dx7","Dx8","Dx9","Dx10","Dx11","Dx12","Dx13","Dx14","Dx15","Dx16","Dx17","Dx18","Dx19","Dx20","SDx"]
["Distance from x=0",null,{"$f":"($B$32+$C$32)/2","v":18},{"$f":"($C$32+$D$32)/2","v":44.5},{"$f":"($D$32+$E$32)/2","v":58},{"$f":"($E$32+$F$32)/2","v":66.5},{"$f":"($F$32+$G$32)/2","v":72.5},{"$f":"($G$32+$H$32)/2","v":77.5},{"$f":"($H$32+$I$32)/2","v":82},{"$f":"($I$32+$J$32)/2","v":85.5},{"$f":"($J$32+$K$32)/2","v":90},{"$f":"($K$32+$L$32)/2","v":94.5},{"$f":"($L$32+$M$32)/2","v":97.5},{"$f":"($M$32+$N$32)/2","v":100},{"$f":"($N$32+$O$32)/2","v":102},{"$f":"($O$32+$P$32)/2","v":104},{"$f":"($P$32+$Q$32)/2","v":106.5},{"$f":"($Q$32+$R$32)/2","v":109},{"$f":"($R$32+$S$32)/2","v":111},{"$f":"($S$32+$T$32)/2","v":113},{"$f":"($T$32+$U$32)/2","v":114}]
["Z från slip surface"]
[0,null,{"$f":"OFFSET($I39,0,(COLUMN(B$1)-COLUMN($B$1))*5)","v":22.845320863972443},23.6907887775752,24.578290551951998,25.491342774870709,26.422968194179109,27.369259893614831,28.327706045031732,29.296550355276707,30.799000000000003,29.860591207108055,28.921182414216105,27.981773621324155,27.042364828432206,26.102956035540256,25.163547242648306,24.224138449756357,23.284729656864407,22.345320863972457,15,15]
[{"$f":"IF(A96<Height/3,A96+1,\"\")","v":1},null,21.703054820773822,22.506249338696438,23.349376024354399,24.216775636127171,25.101819784470155,26.000796898934087,26.911320742780141,27.831722837512871,29.259050000000002,28.367561646752648,27.475123293505298,26.582684940257945,25.690246587010591,24.797808233763242,23.905369880515888,23.012931527268535,22.120493174021185,21.228054820773831,14.25,14.25]
[2,null,20.560788777575198,21.321709899817677,22.1204614967568,22.942208497383639,23.780671374761202,24.63233390425335,25.494935440528561,26.366895319749037,27.719100000000005,26.874532086397249,26.029064172794492,25.183596259191738,24.338128345588984,23.492660431986227,22.647192518383473,21.80172460478072,20.956256691177963,20.110788777575209,13.5,13.5]
[3,null,19.418522734376577,20.137170460938918,20.891546969159197,21.667641358640104,22.459522965052244,23.263870909572606,24.07855013827697,24.902067801985197,26.179150000000003,25.381502526041846,24.583005052083688,23.784507578125531,22.986010104167374,22.187512630209216,21.389015156251059,20.590517682292901,19.792020208334744,18.993522734376587,12.749999999999998,12.75]
[4,null,18.276256691177952,18.95263102206016,19.662632441561598,20.393074219896569,21.13837455534329,21.895407914891869,22.662164836025386,23.437240284221367,24.639200000000002,23.888472965686443,23.136945931372885,22.385418897059324,21.633891862745763,20.882364828432205,20.130837794118644,19.379310759805087,18.627783725491526,17.876256691177964,12.000000000000002,12]
[5,null,17.133990647979331,17.768091583181398,18.433717913964003,19.118507081153034,19.817226145634336,20.526944920211125,21.245779533773796,21.972412766457531,23.099250000000001,22.395443405331037,21.690886810662075,20.986330215993114,20.281773621324152,19.577217026655191,18.872660431986226,18.168103837317265,17.463547242648303,16.758990647979338,11.25,11.25]
[6,null,15.991724604780709,16.583552144302637,17.2048033863664,17.843939942409495,18.496077735925375,19.158481925530381,19.829394231522212,20.507585248693694,21.5593,20.902413844975637,20.244827689951272,19.587241534926907,18.929655379902542,18.272069224878177,17.614483069853812,16.956896914829446,16.299310759805085,15.64172460478072,10.5,10.5]
[7,null,15.226406355837632,15.78991072025387,16.381430652876006,16.989979959451325,17.610908301420377,18.241611719094287,18.880416079013646,19.526150811791926,20.527533500000001,19.902084039537517,19.275968079075032,18.649852118612547,18.023736158150065,17.39762019768758,16.771504237225095,16.14538827676261,15.519272316300125,14.893156355837641,9.9975000000000005,9.9975000000000005]
[""]
[{"$f":"IF(#REF!<Height/3,#REF!+1,\"\")","v":{"$error":"#REF!"}}]
["g(t)"]
[null,null,"Stage I",null,null,null,null,null,null,null,null,"Stage II"]
[null,"start value","Dx1","Dx2","Dx3","Dx4","Dx5","Dx6","Dx7","Dx8","Dx9","Dx10","Dx11","Dx12","Dx13","Dx14","Dx15","Dx16","Dx17","Dx18","Dx19","Dx20","SDx"]
["Distance from X=0",null,{"$f":"($B$32+$C$32)/2","v":18},{"$f":"($C$32+$D$32)/2","v":44.5},{"$f":"($D$32+$E$32)/2","v":58},{"$f":"($E$32+$F$32)/2","v":66.5},{"$f":"($F$32+$G$32)/2","v":72.5},{"$f":"($G$32+$H$32)/2","v":77.5},{"$f":"($H$32+$I$32)/2","v":82},{"$f":"($I$32+$J$32)/2","v":85.5},{"$f":"($J$32+$K$32)/2","v":90},{"$f":"($K$32+$L$32)/2","v":94.5},{"$f":"($L$32+$M$32)/2","v":97.5},{"$f":"($M$32+$N$32)/2","v":100},{"$f":"($N$32+$O$32)/2","v":102},{"$f":"($O$32+$P$32)/2","v":104},{"$f":"($P$32+$Q$32)/2","v":106.5},{"$f":"($Q$32+$R$32)/2","v":109},{"$f":"($R$32+$S$32)/2","v":111},{"$f":"($S$32+$T$32)/2","v":113},{"$f":"($T$32+$U$32)/2","v":114}]
["Z från slip surface"]
[0,0,{"$f":"OFFSET($J39,0,(COLUMN(B$1)-COLUMN($B$1))*5)","v":4.4185206930851971E-4},{"$f":"OFFSET($J39,0,(COLUMN(C$1)-COLUMN($B$1))*5)","v":1.2218654168959725E-3},2.0923927981755163E-3,3.055595156964813E-3,4.128305167363705E-3,5.3427158911762427E-3,6.7594156828066927E-3,8.5118635748795569E-3,1.455850451766327E-2,1.4100545115242303E-2,1.3482513014655494E-2,1.2864480914068685E-2,1.2246448813481876E-2,1.1628416712895067E-2,1.1010384612308258E-2,1.039235251172145E-2,9.7743204111346398E-3,9.1562883105478325E-3,4.3238403737238477E-3,4.3238403737238477E-3]
[{"$f":"IF(A111<Height/3,A111+1,\"\")","v":1},0,{"$f":"OFFSET($J40,0,(COLUMN(B$1)-COLUMN($B$1))*5)","v":4.1513972602361446E-4},1.1449294805041029E-3,1.9540989965284561E-3,2.8416096073977343E-3,3.8181120831347532E-3,4.9041202185507102E-3,6.1353585648452726E-3,7.5788057657613381E-3,1.0641770390435536E-2,1.0042906556686168E-2,9.4413224161948184E-3,8.839738275703465E-3,8.2381541352121133E-3,7.6365699947207625E-3,7.03498585422941E-3,6.4334017137380574E-3,5.8318175732467083E-3,5.2302334327553558E-3,5.2639355812229838E-4,5.2639355812229838E-4]
[2,0,3.8948186284183689E-4,1.0715734142900282E-3,1.823484901140151E-3,2.6419981520867056E-3,3.5335837727347203E-3,4.511421124174189E-3,5.5974240502982085E-3,6.8286562175020969E-3,9.1798803385871718E-3,8.5974198591650345E-3,8.013113930506563E-3,7.4288080018480931E-3,6.8445020731896242E-3,6.2601961445311518E-3,5.6758902158726837E-3,5.0915842872142139E-3,4.5072783585557424E-3,3.9229724298972726E-3,-6.4576757040152657E-4,-6.4576757040152657E-4]
[3,0,3.6474252535954844E-4,1.0013088037909303E-3,1.6994110572245739E-3,2.4543748099909836E-3,3.2698072887086208E-3,4.1541302757835026E-3,5.1210841141404312E-3,6.1923853068794202E-3,8.1278880873593817E-3,7.5631965860207774E-3,6.9970636121452464E-3,6.4309306382697162E-3,5.8647976643941852E-3,5.2986646905186559E-3,4.7325317166431249E-3,4.1663987427675948E-3,3.6002657688920638E-3,3.0341327950165337E-3,-1.3925112562798939E-3,-1.3925112562798922E-3]
[4,0,3.4080237227763479E-4,9.337165540301473E-4,1.5809284183540369E-3,2.2768289528152666E-3,3.0230528206819799E-3,3.824864731477742E-3,4.6909474718798581E-3,5.6344583883246894E-3,7.2807012222360105E-3,6.7348977570415684E-3,6.187903828936003E-3,5.6409099008304358E-3,5.0939159727248686E-3,4.5469220446193032E-3,3.999928116513736E-3,3.452934188408171E-3,2.9059402603026033E-3,2.3589463321970353E-3,-1.9180478187851083E-3,-1.9180478187851117E-3]
[5,0,3.1755552889560658E-4,8.6843271198784534E-4,1.4672348467422965E-3,2.1078005391599796E-3,2.7904086403776891E-3,3.5181978099662501E-3,4.2966211717657306E-3,5.1337829316565435E-3,6.5596871117753024E-3,6.0338892479916105E-3,5.5070795976759181E-3,4.9802699473602248E-3,4.4534602970445324E-3,3.92665064672884E-3,3.3998409964131446E-3,2.8730313460974522E-3,2.3462216957817594E-3,1.8194120454660644E-3,-2.2997594431182142E-3,-2.2997594431182142E-3]
[6,0,2.9490704789649061E-4,8.0513742512505532E-4,1.3576427979352865E-3,1.945993008027244E-3,2.5695464466481744E-3,3.2299997296835123E-3,3.9306987735245168E-3,4.6766435501558196E-3,5.9248764614656113E-3,5.4202584295110524E-3,4.9147663168914923E-3,4.4092742042719322E-3,3.9037820916523716E-3,3.3982899790328115E-3,2.8927978664132514E-3,2.3873057537936913E-3,1.8818136411741342E-3,1.376321528554574E-3,-2.5761662376793072E-3,-2.5761662376793072E-3]
[7,0,2.8002413980975549E-4,7.6369919615797426E-4,1.2862101448404503E-3,1.8410693928167174E-3,2.4271992325204084E-3,3.0456001289469619E-3,3.6986234643564962E-3,4.3898619566105314E-3,5.5356532667219308E-3,5.0459232167784102E-3,4.5553962889296404E-3,4.0648693610808705E-3,3.5743424332321042E-3,3.0838155053833347E-3,2.5932885775345653E-3,2.1027616496857963E-3,1.6122347218370265E-3,1.1217077939882593E-3,-2.7137658621352668E-3,-2.7137658621352668E-3]
[""]
[""]
["d (t)"]
[null,null,"Stage I",null,null,null,null,null,null,null,null,"Stage II"]
[null,"start value","Dx1","Dx2","Dx3","Dx4","Dx5","Dx6","Dx7","Dx8","Dx9","Dx10","Dx11","Dx12","Dx13","Dx14","Dx15","Dx16","Dx17","Dx18","Dx19","Dx20","SDx"]
["Distance from X=0",null,{"$f":"($B$32+$C$32)/2","v":18},{"$f":"($C$32+$D$32)/2","v":44.5},{"$f":"($D$32+$E$32)/2","v":58},{"$f":"($E$32+$F$32)/2","v":66.5},{"$f":"($F$32+$G$32)/2","v":72.5},{"$f":"($G$32+$H$32)/2","v":77.5},{"$f":"($H$32+$I$32)/2","v":82},{"$f":"($I$32+$J$32)/2","v":85.5},{"$f":"($J$32+$K$32)/2","v":90},{"$f":"($K$32+$L$32)/2","v":94.5},{"$f":"($L$32+$M$32)/2","v":97.5},{"$f":"($M$32+$N$32)/2","v":100},{"$f":"(N14+O14)/2","v":0},{"$f":"($O$32+$P$32)/2","v":104},{"$f":"($P$32+$Q$32)/2","v":106.5},{"$f":"($Q$32+$R$32)/2","v":109},{"$f":"($R$32+$S$32)/2","v":111},{"$f":"($S$32+$T$32)/2","v":113},{"$f":"($T$32+$U$32)/2","v":114}]
["Z från slip surface"]
[0,0,{"$f":"OFFSET($K39,0,(COLUMN(B$1)-COLUMN($B$1))*5)","v":0},0,0,0,0,0,0,0,0,0,0,0,0,0,0,0,0,0,0,0]
[{"$f":"IF(A126<Height/3,A126+1,\"\")","v":1},0,4.2849589766606711E-4,1.1833974487000377E-3,2.023245897351986E-3,2.9486023821812734E-3,3.9732086252492289E-3,5.123418054863476E-3,6.4473871238259831E-3,8.0453346703204479E-3,1.2600137454049403E-2,1.2071725835964235E-2,1.1461917715425155E-2,1.0852109594886075E-2,1.0242301474346995E-2,9.6324933538079142E-3,9.0226852332688338E-3,8.4128771127297535E-3,7.803068992190674E-3,7.1932608716515946E-3,2.425116965923073E-3,2.425116965923073E-3]
[2,0,4.0231079443272567E-4,1.1082514473970656E-3,1.8887919488343036E-3,2.7418038797422202E-3,3.6758479279347367E-3,4.70777067136245E-3,5.866391307571741E-3,7.2037309916317179E-3,9.9108253645113532E-3,9.3201632079256014E-3,8.7272181733506898E-3,8.13427313877578E-3,7.5413281042008683E-3,6.9483830696259567E-3,6.3554380350510468E-3,5.7624930004761352E-3,5.1695479659012254E-3,4.5766029313263137E-3,-5.9687006139614099E-5,-5.9687006139614099E-5]
[3,0,3.7711219410069264E-4,1.0364411090404793E-3,1.7614479791823625E-3,2.5481864810388446E-3,3.4016955307216703E-3,4.3327756999788462E-3,5.3592540822193198E-3,6.510520762190759E-3,8.6538842129732767E-3,8.0803082225929055E-3,7.5050887713259042E-3,6.9298693200589047E-3,6.3546498687919051E-3,5.7794304175249039E-3,5.2042109662579043E-3,4.6289915149909048E-3,4.0537720637239035E-3,3.4785526124569031E-3,-1.0191394133407103E-3,-1.0191394133407094E-3]
[4,0,3.5277244881859162E-4,9.6751267891053881E-4,1.6401697377893053E-3,2.3656018814031251E-3,3.1464300546953003E-3,3.9894975036306223E-3,4.9060157930101451E-3,5.9134218476020548E-3,7.7042946547976957E-3,7.1490471715311733E-3,6.5924837205406251E-3,6.035920269550076E-3,5.4793568185595269E-3,4.9227933675689796E-3,4.3662299165784305E-3,3.8096664655878831E-3,3.2531030145973336E-3,2.6965395636067845E-3,-1.6552795375325011E-3,-1.655279537532502E-3]
[5,0,3.2917895058662066E-4,9.0107463300899632E-4,1.5240816325481667E-3,2.1923147459876231E-3,2.9067307305298343E-3,3.671531270721996E-3,4.4937843218227948E-3,5.3841206599906169E-3,6.9201941670056569E-3,6.3843935025165895E-3,5.847491713305961E-3,5.3105899240953307E-3,4.7736881348847005E-3,4.236786345674072E-3,3.6998845564634401E-3,3.1629827672528116E-3,2.6260809780421814E-3,2.0891791888315498E-3,-2.1089036309516612E-3,-2.108903630951663E-3]
[6,0,3.0623128839604859E-4,8.3678506855645028E-4,1.4124388223387915E-3,2.0268967735936117E-3,2.6799775435129318E-3,3.3740987698248812E-3,4.1136599726451237E-3,4.9052132409061816E-3,6.2422817866204568E-3,5.7270738387513315E-3,5.2109229572837052E-3,4.6947720758160789E-3,4.1786211943484518E-3,3.6624703128808256E-3,3.146319431413198E-3,2.6301685499455717E-3,2.1140176684779468E-3,1.5978667870103192E-3,-2.4379628403987607E-3,-2.4379628403987607E-3]
[7,0,1.926019478815924E-4,5.2556026812981479E-4,8.8569073582987171E-4,1.2686659042827268E-3,1.6739098025214752E-3,2.1023259526412085E-3,2.5558229496901392E-3,3.0372793447667268E-3,3.8392774589428263E-3,3.5061708515069698E-3,3.1725044729500793E-3,2.8388380943931888E-3,2.5051717158362991E-3,2.1715053372794086E-3,1.8378389587225185E-3,1.5041725801656282E-3,1.1705062016087388E-3,8.3683982305184903E-4,-1.7721272534378821E-3,-1.7721272534378821E-3]
[]
[]
["Summary"]
[null,null,"Stage I",null,null,null,null,null,null,null,null,"Stage II"]
[null,"start value","Dx1","Dx2","Dx3","Dx4","Dx5","Dx6","Dx7","Dx8","Dx9","Dx10","Dx11","Dx12","Dx13","Dx14","Dx15","Dx16","Dx17","Dx18","Dx19","Dx20"]
["Distance from foot of slope where x=0",null,{"$f":"B32&\" (\"&ROUND($V$30,0)&\")\"","v":"0 (152)"},"36 (152)","53 (152)","63 (152)","70 (152)","75 (152)","80 (152)","84 (152)","87 (152)","93 (152)","96 (152)","99 (152)","101 (152)","103 (152)","105 (152)","108 (152)","110 (152)","112 (152)","114 (152)","114 (152)"]
[null,0,{"$f":"($B$32+$C$32)/2","v":18},{"$f":"($C$32+$D$32)/2","v":44.5},{"$f":"($D$32+$E$32)/2","v":58},{"$f":"($E$32+$F$32)/2","v":66.5},{"$f":"($F$32+$G$32)/2","v":72.5},{"$f":"($G$32+$H$32)/2","v":77.5},{"$f":"($H$32+$I$32)/2","v":82},{"$f":"($I$32+$J$32)/2","v":85.5},{"$f":"($J$32+$K$32)/2","v":90},{"$f":"($K$32+$L$32)/2","v":94.5},{"$f":"($L$32+$M$32)/2","v":97.5},{"$f":"($M$32+$N$32)/2","v":100},{"$f":"($N$32+$O$32)/2","v":102},{"$f":"($O$32+$P$32)/2","v":104},{"$f":"($P$32+$Q$32)/2","v":106.5},{"$f":"($Q$32+$R$32)/2","v":109},{"$f":"($R$32+$S$32)/2","v":111},{"$f":"($S$32+$T$32)/2","v":113},{"$f":"($T$32+$U$32)/2","v":114},{"$f":"($T$32+V30)/2","v":133.1018345332833}]
["D N",0,{"$f":"OFFSET($J50,0,(COLUMN(B$1)-COLUMN($B$1))*5)","v":9.0964565147526262},15.724546548005129,17.021260885617803,18.141356501178837,19.286193438453218,20.576632358754889,22.135861784956948,24.250648699232567,46.792250799617037,22.373471644984058,17.785926633477835,14.377679256482748,11.544325678641227,9.0775636623688758,6.8530461784306622,4.7904484702559893,2.8368533613918561,0.93913796826323082,-6.7911303194260698E-12,-283.60308317210502,"D N"]
["SD N",0,9.0964565147526262,24.821003062757754,41.84226394837556,59.983620449554394,79.269813888007604,99.846446246762497,121.98230803171944,146.232956730952,193.02520753056905,215.3986791755531,233.18460580903093,247.56228506551366,259.10661074415486,268.18417440652377,275.03722058495441,279.82766905521038,282.66452241660221,283.60366038486546,283.6036603848587,5.77212753682943E-4,"SD N"]
[" d (N)",0,2.3884409681393325E-3,4.1709498551103239E-3,4.5764096626770435E-3,4.9564086178878961E-3,5.3658014896914887E-3,5.8442964528463729E-3,6.4389046506369216E-3,7.2581669601271713E-3,1.4872539737037652E-2,8.2581162146516986E-3,8.171724647448083E-3,8.1685942200414186E-3,8.1693128664100424E-3,8.1707585215194806E-3,8.1704858953970567E-3,8.1673057329709579E-3,8.1717962661034295E-3,8.1702803555963929E-3,7.5685579592171633E-15,7.9017433037620738E-2," d (N)"]
["S d (N)",0,2.3884409681393325E-3,6.559390823249656E-3,1.1135800485926699E-2,1.6092209103814595E-2,2.1458010593506084E-2,2.7302307046352458E-2,3.3741211696989376E-2,4.0999378657116545E-2,5.5871918394154195E-2,6.4130034608805897E-2,7.2301759256253983E-2,8.04703534762954E-2,8.8639666342705439E-2,9.681042486422492E-2,0.10498091075962197,0.11314821649259293,0.12132001275869636,0.12949029311429275,0.12949029311430033,0.20850772615192106,"S d (N)"]
["S d (t)",0,2.3887035218823384E-3,6.5590226537433818E-3,1.1135866753874788E-2,1.6092072048229423E-2,2.145780021516518E-2,2.7301417923023479E-2,3.3742315550785246E-2,4.0999621517408505E-2,5.5870895098900669E-2,6.4130133173724874E-2,7.2300128610054248E-2,8.0470124046383651E-2,8.8640119482713026E-2,9.6810114919042414E-2,0.1049801103553718,0.11315010579170118,0.12132010122803057,0.12949009666435993,0.12949029311430033,0.20850772615192106,"S d (t)"]
[{"$f":"IF(A145<Height/3,A145+1,\"\")","v":""}]
[]
[]
["End of Stage I","N",{"$f":"K142","v":193.02520753056905},"kN/m3"]
["End of stageI","x",{"$f":"K32","v":93},"m"]
["Critical Load","Ncrit [kN/m3]",{"$f":"MAX(C142:V142)","v":283.60366038486546},"kN/m3"]
["Critical lenght","Lcrit [m]",{"$f":"T32","v":114},"m"]
[null,"Linstab",{"$f":"U30","v":38.610033302034523},"m"]
[null,"q",{"$f":"C151/Height","v":14.180183019243273},"kN/m2"]
["Critical deformation","dcrit",{"$f":"$T$145","v":0.12949009666435993},"m"]
["Momentarily def","dinstab",{"$f":"$V$145","v":0.20850772615192106},"m"]